{"text_format":"1","workbook":"xlsx","n_sheets":5,"sheets":["inputs and results","Variable information","calcs - classic","early retirement","factors - classic"],"not_rendered":{"charts":0,"images":1,"macros":1,"external_links":0,"defined_names":1,"comments":3,"pivot_tables":0},"unopened":[],"bounds":{"document_bytes":16777216,"sheet_cells":100000,"rows_first":2000,"rows_last":500,"rows_between":2000,"halvings":0,"cell_chars":16384,"cell_head_chars":4096},"cells_cut":0,"cells_raw":0,"read":"whole","date_system":"1900"}

{"sheet":"inputs and results","index":0,"n_rows":51,"n_cols":13,"rows_kept":51,"cut":false,"hidden":false,"merged":[[35,2,35,11],[34,2,34,11],[46,2,46,11],[36,2,36,11],[38,2,38,11],[40,2,40,11],[42,2,42,11],[39,2,39,11],[41,2,41,11],[43,2,43,11],[45,2,45,11],[37,2,37,11],[0,4,0,8],[30,2,30,11],[31,2,31,11],[32,2,32,11],[33,2,33,11]]}
[null,null,null,null,"Added pension estimator -\nfor members of classic"]
[null,"Please fill in all of the blue boxes and either one or other of the green boxes "]
[]
[null,"About you",null,null,null,null,null,null,null,null,null,null,{"$f":"'calcs - classic'!F6","v":"1965-11-25"}]
[null,null,null,null,null,null,null,null,null,null,null,null,"female"]
[null,null,null,null,"What is your date of birth? ",null,null,null,null,null,null,null,"male"]
[]
[null,null,null,null,"What is your gender? "]
[]
[null,null,null,null,"Are you using Civil Service compensation to buy your added pension?  ",null,null,null,null,null,null,null,{"$f":"\"You cannot buy more than \"&TEXT('calcs - classic'!G3,\"£0,000\")&\" added pension\"","v":"You cannot buy more than £7,500 added pension"}]
[]
[null,"About your added pension"]
[]
[null,null,null,null,"How do you want to pay for your added pension? ",null,null,null,null,{"$f":"IF(G14=\"monthly contributions\",\"For how many years? \",\"\")","v":""},5,null,"lump sum"]
[null,null,null,null,null,null,null,null,null,null,null,null,"monthly contributions"]
[null,null,null,null,"At what age do you expect to draw your added pension? ",null,{"$f":"IF(DATEDIF(G6,NOW(),\"y\") < 60,60, DATEDIF(G6,NOW(),\"y\") + 1)","v":126}]
[null,null,null,null,null,null,null,null,{"$f":"'calcs - classic'!$A$83","v":"The calculator cannot provide a result based upon the information you have entered. Please contact the Civil Service Pension Scheme Administrator for a quotation."},null,null,null,"yes"]
[null,null,null,null,null,null,null,null,null,null,null,null,"no"]
[]
[null,"Either: ",null,null,"How much do you want to save? ",null,null,null,{"$f":"IF(G14=\"lump sum\",\" \",\"per month\")","v":"per month"},{"$f":"IF(AND(G20<>\"\",G22<>\"\"),\"please enter figures into only one of the boxes, leave the other blank\",\"\")","v":""}]
[]
[null,"Or: ",null,null,"How much pension do you want to buy? ",null,null,null,"a year ",{"$f":"IF(AND(OR(G10=\"no\",G14=\"monthly contributions\"),G22>'calcs - classic'!G3),M10,\" \")","v":" "}]
[null,null,null,null,null,null,{"$f":"IF(M23=2,\"plus an automatic lump sum\",\"\")","v":"plus an automatic lump sum"},null,null,null,null,null,{"$f":"IF(G20<>\"\",1,2)","v":2}]
[null,"Your results"]
[]
[null,null,null,null,{"$f":"IF(M23=1,\"Your savings will buy an annual pension of: \",\"This pension will cost you: \")","v":"This pension will cost you: "},null,null,null,{"$f":"IF(AND('calcs - classic'!D2=\"periodicals\",'calcs - classic'!B4<>\"savings\"),\"per month\",IF('calcs - classic'!B4=\"savings\",\"\",\"\"))","v":"per month"},{"$f":"IF('calcs - classic'!B4=\"savings\",'calcs - classic'!A29,\"\")","v":""}]
[]
[null,null,null,null,{"$f":"IF(M23=1,\"and a lump sum of: \",\"\")","v":""},null,null,null,{"$f":"IF(G20>0,\"\",\" \")","v":" "}]
[]
[null,"Important notes:"]
[null,1,"The added pension estimator held on the Civil Service Pension website uses the latest calculation factors. These factors, and therefore the results, may be subject to change in the future."]
[null,2,"Please note that if you do not use the most recent version of the added pension estimator then the results will not be valid. The latest estimator is held on the Civil Service Pension Scheme website: www.civilservicepensionscheme.org.uk",null,null,null,null,null,null,null,null,null,"enter a date"]
[null,3,"The cost shown is the gross amount. You will normally get income tax relief on these contributions. If you make your payment through payroll the tax relief will be applied automatically. If you make a lump sum purchase by cheque you will have to claim tax relief from HM Revenue & Customs.",null,null,null,null,null,null,null,null,null,52]
[null,4,"As well as providing extra pension for you, added pension will provide an automatic lump sum of 3 times pension plus extra pension for your dependants after your death. The spouse / civil partner pension is usually half your pension.",null,null,null,null,null,null,null,null,null,54]
[null,5,"In most circumstances your added pension will come into payment at the same time as your core pension. If you draw your pension before Normal Pension Age (NPA) it will be reduced for early payment. If you carry on working beyond your NPA, your pension will be increased for late payment. These adjustments have not been reflected in your results.",null,null,null,null,null,null,null,null,null,56]
[null,6,"Added pension will be adjusted in line with prices.",null,null,null,null,null,null,null,null,null,59]
[null,7,"If you have selected monthly contributions, the estimator assumes that these start from the next 1 April and run for a complete number of years.",null,null,null,null,null,null,null,null,null,60]
[null,8,"The figures shown are an illustration of the current cost of buying added pension.",null,null,null,null,null,null,null,null,null,61]
[null,9,"If you have selected monthly contributions, the estimator assumes that these start from the date that your contract starts and run for a complete number of years. You can request to cancel your monthly contributions at any time. Lump sum purchases are assumed to be made at the contract start date. You cannot buy added pension by lump sum in your first 12 months of scheme membership.",null,null,null,null,null,null,null,null,null,62]
[null,10,"If you have selected to pay contributions over a number of years, the estimator has taken account of your age increasing over the period and resulting amount of added pension that the current factors will purchase in each future year. However, you should be aware that the factors underlying these calculations are reviewed regularly and the cost of this level of pension may change in the future.",null,null,null,null,null,null,null,null,null,64]
{"$rows_left_out":12}
{"sheet":"Variable information","index":1,"n_rows":26,"n_cols":12,"rows_kept":26,"cut":false,"hidden":true,"merged":[]}
["APACs - please select the quote date you require"]
[]
[]
["Required quote date","today",null,{"$f":"IF(L5=2,B6,TODAY())","v":"2025-11-25"}]
["(drop-down menu)",null,null,{"$f":"DATE((YEAR(D4)),MONTH(D4)-1,28)","v":"2025-10-28"},"earlier date to use where \"today\" is before AMC updated",null,null,null,null,null,"today",{"$f":"IF(B4=K6,2,1)","v":1}]
[{"$f":"IF(L5=2,\"Enter quote date\",\"\")","v":""},null,null,{"$f":"IF(D4>TODAY()+31,\"Quote date more than one month ahead\",\"\")","v":""},null,null,null,null,null,null,"your choice"]
[]
["AMC yield for quote date",{"$f":"IF(D4<=TODAY(),VLOOKUP(MONTH(D4),B15:I26,YEAR(D4)-2005),VLOOKUP(MONTH(TODAY()),B15:G26,YEAR(TODAY())-2005))","v":{"$error":"#REF!"}},"%"]
["AMC yield to use",0,"%","Note: Use AMC rate of 0.00 from July 2012 onwards"]
[]
[]
[null,"AMC rates - you must keep this table up to date"]
[]
[null,"Month",2007,2008,2009,2010,2011,2012]
[null,1,null,1.1299999999999999,0.84,0.6,0.64,9.9999999999999994E-12]
[null,2,null,1.1200000000000001,0.93,0.71,0.8,9.9999999999999994E-12]
[null,3,1.38,1.03,1.2,0.83,0.69,0.02]
[null,4,1.55,1.02,0.98,0.64,0.69,0.01]
[null,5,1.66,1.05,1.0900000000000001,0.72,0.63,0.05]
[null,6,1.82,1.18,1.03,0.76,0.59,9.9999999999999994E-12]
[null,7,1.8,1.02,0.9,0.7,0.57999999999999996,"See note"]
[null,8,1.64,1.07,0.94,0.86,0.43]
[null,9,1.51,1,0.67,0.64,0.4]
[null,10,1.48,0.83,0.61,0.57999999999999996,0.23]
[null,11,1.42,1.31,0.56999999999999995,0.71,0.22]
[null,12,1.23,1.31,0.5,0.76,9.9999999999999994E-12]

{"sheet":"calcs - classic","index":2,"n_rows":84,"n_cols":15,"rows_kept":84,"cut":false,"hidden":true,"merged":[]}
["Note: Need to update AMC and Quote Date"]
["Chosen contribution type",{"$f":"'inputs and results'!G14","v":0},{"$f":"IF(D2<>\"LS\",'inputs and results'!K14,0)","v":5},{"$f":"IF(B2=\"lump sum\",\"LS\",\"periodicals\")","v":"periodicals"},null,"AMC rate",{"$f":"'Variable information'!B9","v":0}]
["Chosen pension","self + partner",{"$f":"IF(B3=\"pension for self only\",\"self\",\"self+\")","v":"self+"},null,null,"HMT max",{"$f":"IF(D2=\"periodicals\",7500,7500)","v":7500},null,"pension","LS","adjustment to LS"]
["Chosen calculation type",{"$f":"IF('inputs and results'!G20<>\"\",\"savings\",\"target pension\")","v":"target pension"},null,null,null,"age addition",5.5E-2,"early ret",{"$f":"IF(AND($C$6>=50,$C$6<60),VLOOKUP($H$9,'early retirement'!$A$5:$M$14,2+H10),1)","v":1},{"$f":"IF(AND($C$6>=50,$C$6<60),VLOOKUP($H$9,'early retirement'!$A$20:$M$29,2+H10),1)","v":1},{"$f":"IF(J4<>0,J4/I4,1)","v":1}]
["Monetary amount input",{"$f":"IF(B4=\"savings\",'inputs and results'!G20,'inputs and results'!G22)","v":0},null,null,null,{"$f":"MAX(G5,H5)","v":"2025-11-25"},"2007-10-01",{"$f":"TODAY()","v":"2025-11-25"}]
["pension age",60,{"$f":"IF(E6=\"enter a date\",MAX(B9,E7),E6)","v":126},{"$f":"'inputs and results'!J16","v":"00:00:00"},{"$f":"'inputs and results'!G16","v":126},{"$f":"DATE(YEAR(F5)-60,MONTH(F5),DAY(F5))","v":"1965-11-25"}]
["DOB",{"$f":"'inputs and results'!G6","v":"00:00:00"},{"$f":"DATE(B6+YEAR(B7),MONTH(B7),DAY(B7))","v":"1959-12-31"},{"$f":"IF(MONTH(B7)<=3,0,1)","v":0},{"$f":"ROUND(YEAR(D6)-YEAR(B7)+(D6-DATE(YEAR(D6),MONTH(B7),DAY(B7)))/365,4)","v":0}]
["Quote date",{"$f":"'Variable information'!D4","v":"2025-11-25"},{"$f":"IF(OR(MONTH(B8)<=3,AND(MONTH(B8)=4,DAY(B8)=1)),1,0)","v":0},{"$f":"DATE(YEAR(B8)+1-C8,4,1)","v":"2026-04-01"},{"$f":"IF(MONTH(D8)<=3,1,0)","v":0},null,null,"age at retirement"]
["Age at quote date",{"$f":"YEAR(B8)-YEAR($B$7)+(B8-DATE(YEAR(B8),MONTH($B$7),DAY($B$7)))/365","v":125.9013698630137},null,{"$f":"ROUNDDOWN(YEAR(D8)-YEAR($B$7)+(D8-DATE(YEAR(D8),MONTH($B$7),DAY($B$7)))/365,0)","v":126},{"$f":"ROUNDDOWN(YEAR(D8)-YEAR($B$7)+(D8-DATE(YEAR(D8),MONTH($B$7),DAY($B$7)))/365,0)","v":126},null,null,{"$f":"INT(C6)","v":126},"years"]
["No of 1 Aprils to PA",{"$f":"MAX(0,YEAR($C$7)-YEAR(B8)+C8+D7-1)","v":0},null,{"$f":"MAX(0,YEAR($C$7)-YEAR(D8)+E8+D7-1)","v":0},null,null,null,{"$f":"J10+IF(J10<0,12,0)","v":0},"months",{"$f":"IF(E6=\"enter a date\",(MONTH(D6)-MONTH(B7))-IF(DAY(D6)<DAY(B7),1,0),0)","v":0}]
["m/f",{"$f":"'inputs and results'!G8","v":0},{"$f":"LEFT(B11)","v":"0"},{"$f":"IF(C3=\"self+\",8,IF(C11=\"f\",5,4))","v":8},{"$f":"IF(C3=\"self+\",7,IF(C11=\"f\",3,2))","v":7}]
["Lump sum calcs",null,null,null,"AMC calc",null,null,"New Perodical Calc"]
["factor below",{"$f":"VLOOKUP(INT($B$9),'factors - classic'!$A$4:$H$63,$E$11)","v":15.97},null,null,"column 1",{"$f":"INT(G2)","v":0},null,"Exact Factor",{"$f":"VLOOKUP(INT($D$9),'factors - classic'!$A$4:$H$63,$D$11)","v":16.75}]
["factor above",{"$f":"VLOOKUP(INT($B$9)+1,'factors - classic'!$A$4:$H$63,$E$11)","v":15.97},null,null,"age at quote",{"$f":"B9","v":125.9013698630137},null,"Contribution Factor",{"$f":"VLOOKUP($D$10,'factors - classic'!$J$4:$K$54,2)","v":1}]
["exact factor",{"$f":"B13","v":15.97},{"$f":"ROUND(B13+(B14-B13)*(B9-INT(B9)),4)","v":15.97},null,"factor below",{"$f":"VLOOKUP(INT(F14),'factors - classic'!A65:E126,$F$13+2)","v":1},null,"Exact Factor x Contribution Factor",{"$f":"I13*I14","v":16.75}]
["Aprils factor",{"$f":"VLOOKUP($B$10,'factors - classic'!$J$4:$K$54,2)","v":1},null,null,"factor above",{"$f":"VLOOKUP(INT(F14),'factors - classic'!A67:E126,F13+3)","v":1},null,"Monthly Rate",{"$f":"D21/I15*C2","v":0}]
["lump sum rate before AMC",{"$f":"ROUND(B15*B16,4)","v":15.97},null,null,"exact factor",{"$f":"ROUND(F15+(F16-F15)*(G2-INT(G2)),4)","v":1}]
["AMC adjustment",{"$f":"F17","v":1}]
["lump sum rate",{"$f":"ROUND(B17*B18,4)","v":15.97}]
[null,null,null,null,null,null,null,"Max"]
["required level of contribution",{"$f":"IF(D2=\"periodicals\",'inputs and results'!G20,0)","v":0},"per month",{"$f":"B21*12","v":0},{"$f":"I16","v":0},"annual pension",null,{"$f":"G3/(12*D22*IF(E32>1,E32,1))","v":{"$error":"#DIV/0!"}},"per month"]
[null,{"$f":"C2","v":5},"years",{"$f":"VLOOKUP(B22,A35:G79,7)","v":0},null,null,null,null,null,null,null,null,null,1.2474864979738591]
[null,{"$f":"IF(D2=\"LS\",'inputs and results'!G20,0)","v":0},"lump sum",{"$f":"IF(B22<>0,VLOOKUP(B22,$A$35:$H$79,8),0)","v":131},{"$f":"B23/B19*F32","v":0},"annual pension",null,{"$f":"G3*B19/(IF(F32>1,F32,1))","v":119775},"Lump sum",null,null,{"$f":"D21/20.49","v":0}]
[]
["required amount of pension 1",{"$f":"IF(D2=\"LS\",'inputs and results'!G22,0)","v":0},"pa",null,{"$f":"B25*B19/F32","v":0},"lump sum",null,{"$f":"G3","v":7500},"pension"]
["required pension 2",{"$f":"IF(D2=\"periodicals\",'inputs and results'!G22,0)","v":0},"pa",null,{"$f":"((I15*B26)/C2)/12","v":0},"per month",null,{"$f":"G3","v":7500}]
[]
["Required answer",{"$f":"IF(AND(D2=\"LS\",B4=\"savings\"),E23,IF(AND(D2=\"periodicals\",B4=\"savings\"),E21,IF(D2=\"LS\",E25,E26)))","v":0},null,"Max",{"$f":"INDEX(H21:H26,MATCH(B28,E21:E26,0))","v":{"$error":"#DIV/0!"}},{"$f":"INDEX(B21:B26,MATCH(B28,E21:E26,0))","v":0}]
[{"$f":"IF(AND(OR('inputs and results'!G10=\"no\",B2=\"monthly contributions\"),F28>E28),\"The maximum contribution you can pay is \"&TEXT(E28,\"£#,###.00\")&\"\",\"\")","v":{"$error":"#DIV/0!"}},null,null,null,"monthly","lump sum"]
[{"$f":"IF(C2>D10,\"These contributions take you beyond age 65\",\"\")","v":"These contributions take you beyond age 65"},null,"late retirement",null,{"$f":"MAX(0,MIN(C6-D23,C6-B6))","v":0},{"$f":"MAX(0,MIN(C6-D9,C6-B6))","v":0}]
[null,null,"early retirement",null,{"$f":"MAX(0,B6-C6)","v":0},{"$f":"E31","v":0}]
[null,null,"adjustment",null,1,1]
["Periodicals calc"]
["Year","factor below","factor above","rate","Aprils","periodicals","cum purchase","age at end of year",null,"fraction",null,null,null,null,{"$f":"ROUND(B35+(C35-B35),4)","v":16.75}]
[1,{"$f":"VLOOKUP(INT($D$9),'factors - classic'!$A$4:$H$63,$D$11)","v":16.75},{"$f":"VLOOKUP(INT($D$9)+1,'factors - classic'!$A$4:$H$63,$D$11)","v":16.75},{"$f":"ROUND(B35+(C35-B35)*($D$9-INT($D$9)),4)","v":16.75},{"$f":"VLOOKUP($D$10,'factors - classic'!$J$4:$K$54,2)","v":1},{"$f":"E35*D35","v":16.75},{"$f":"J35/F35","v":0},{"$f":"$D$9+A35","v":127},{"$f":"H35-INT(H35)","v":0},{"$f":"IF(H35<$C$6,1,IF(H35-$C$6<1,1-(H35-$C$6),0))","v":0},null,null,null,null,{"$f":"($D$9-INT($D$9))","v":0}]
[2,{"$f":"VLOOKUP(INT($D$9+A36-1),'factors - classic'!$A$4:$H$63,$D$11)","v":16.75},{"$f":"VLOOKUP(INT($D$9)+A36,'factors - classic'!$A$4:$H$63,$D$11)","v":16.75},{"$f":"ROUND(B36+(C36-B36)*($D$9-INT($D$9)),4)","v":16.75},{"$f":"VLOOKUP(MAX(0,$D$10+1-A36),'factors - classic'!$J$4:$K$54,2)","v":1},{"$f":"E36*D36","v":16.75},{"$f":"G35*(1+IF(H36>=61,$G$4,IF(H36>=60,$G$4*$I$35,0)))+J36/F36","v":0},{"$f":"$D$9+A36","v":128},null,{"$f":"IF(H36<$C$6,1,IF(H36-$C$6<1,1-(H36-$C$6),0))","v":0}]
[3,{"$f":"VLOOKUP(INT($D$9+A37-1),'factors - classic'!$A$4:$H$63,$D$11)","v":16.75},{"$f":"VLOOKUP(INT($D$9)+A37,'factors - classic'!$A$4:$H$63,$D$11)","v":16.75},{"$f":"ROUND(B37+(C37-B37)*($D$9-INT($D$9)),4)","v":16.75},{"$f":"VLOOKUP(MAX(0,$D$10+1-A37),'factors - classic'!$J$4:$K$54,2)","v":1},{"$f":"E37*D37","v":16.75},{"$f":"G36*(1+IF(H37>=61,$G$4,IF(H37>=60,$G$4*$I$35,0)))+J37/F37","v":0},129,null,0]
[4,{"$f":"VLOOKUP(INT($D$9+A38-1),'factors - classic'!$A$4:$H$63,$D$11)","v":16.75},{"$f":"VLOOKUP(INT($D$9)+A38,'factors - classic'!$A$4:$H$63,$D$11)","v":16.75},16.75,{"$f":"VLOOKUP(MAX(0,$D$10+1-A38),'factors - classic'!$J$4:$K$54,2)","v":1},16.75,0,130,null,0]
[5,{"$f":"VLOOKUP(INT($D$9+A39-1),'factors - classic'!$A$4:$H$63,$D$11)","v":16.75},{"$f":"VLOOKUP(INT($D$9)+A39,'factors - classic'!$A$4:$H$63,$D$11)","v":16.75},16.75,{"$f":"VLOOKUP(MAX(0,$D$10+1-A39),'factors - classic'!$J$4:$K$54,2)","v":1},16.75,0,131,null,0]
[6,{"$f":"VLOOKUP(INT($D$9+A40-1),'factors - classic'!$A$4:$H$63,$D$11)","v":16.75},{"$f":"VLOOKUP(INT($D$9)+A40,'factors - classic'!$A$4:$H$63,$D$11)","v":16.75},16.75,{"$f":"VLOOKUP(MAX(0,$D$10+1-A40),'factors - classic'!$J$4:$K$54,2)","v":1},16.75,0,132,null,0]
{"$rows_left_out":45}
{"sheet":"early retirement","index":3,"n_rows":29,"n_cols":13,"rows_kept":29,"cut":false,"hidden":true,"merged":[]}
["Early pension factors "]
[]
[null,"Months"]
["Age (y)",0,1,2,3,4,5,6,7,8,9,10,11]
[50,0.63700000000000001,0.63900000000000001,0.64100000000000001,0.64300000000000002,0.64600000000000002,0.64800000000000002,0.65,0.65200000000000002,0.65400000000000003,0.65600000000000003,0.65800000000000003,0.66100000000000003]
[51,0.66300000000000003,0.66500000000000004,0.66700000000000004,0.67,0.67200000000000004,0.67400000000000004,0.67700000000000005,0.67900000000000005,0.68100000000000005,0.68300000000000005,0.68600000000000005,0.68799999999999994]
[52,0.69,0.69299999999999995,0.69499999999999995,0.69799999999999995,0.7,0.70299999999999996,0.70499999999999996,0.70799999999999996,0.71,0.71299999999999997,0.71499999999999997,0.71799999999999997]
[53,0.72,0.72299999999999998,0.72599999999999998,0.72799999999999998,0.73099999999999998,0.73399999999999999,0.73599999999999999,0.73899999999999999,0.74199999999999999,0.74399999999999999,0.747,0.75]
[54,0.753,0.75600000000000001,0.75800000000000001,0.76100000000000001,0.76400000000000001,0.76700000000000002,0.77,0.77300000000000002,0.77600000000000002,0.77900000000000003,0.78200000000000003,0.78500000000000003]
[55,0.78800000000000003,0.79100000000000004,0.79400000000000004,0.79700000000000004,0.8,0.80300000000000005,0.80600000000000005,0.80900000000000005,0.81200000000000006,0.81499999999999995,0.81899999999999995,0.82199999999999995]
[56,0.82499999999999996,0.82799999999999996,0.83199999999999996,0.83499999999999996,0.83799999999999997,0.84099999999999997,0.84499999999999997,0.84799999999999998,0.85099999999999998,0.85499999999999998,0.85799999999999998,0.86099999999999999]
[57,0.86499999999999999,0.86799999999999999,0.872,0.875,0.879,0.88200000000000001,0.88600000000000001,0.89,0.89300000000000002,0.89700000000000002,0.9,0.90400000000000003]
[58,0.90700000000000003,0.91100000000000003,0.91500000000000004,0.91900000000000004,0.92300000000000004,0.92600000000000005,0.93,0.93400000000000005,0.93799999999999994,0.94199999999999995,0.94499999999999995,0.94899999999999995]
[59,0.95299999999999996,0.95699999999999996,0.96099999999999997,0.96499999999999997,0.96899999999999997,0.97399999999999998,0.97799999999999998,0.98199999999999998,0.98599999999999999,0.99,0.99399999999999999,0.998]
[]
[]
["Early lump sum factors"]
[]
[null,0,1,2,3,4,5,6,7,8,9,10,11]
[50,0.72799999999999998,0.73,0.73199999999999998,0.73399999999999999,0.73599999999999999,0.73799999999999999,0.74,0.74199999999999999,0.74299999999999999,0.745,0.747,0.749]
[51,0.751,0.753,0.755,0.75700000000000001,0.75900000000000001,0.76100000000000001,0.76300000000000001,0.76500000000000001,0.76700000000000002,0.76900000000000002,0.77100000000000002,0.77300000000000002]
[52,0.77500000000000002,0.77700000000000002,0.77900000000000003,0.78100000000000003,0.78300000000000003,0.78500000000000003,0.78700000000000003,0.78900000000000003,0.79100000000000004,0.79300000000000004,0.79500000000000004,0.79700000000000004]
[53,0.79900000000000004,0.80100000000000005,0.80300000000000005,0.80600000000000005,0.80800000000000005,0.81,0.81200000000000006,0.81399999999999995,0.81599999999999995,0.81799999999999995,0.82,0.82299999999999995]
[54,0.82499999999999996,0.82699999999999996,0.82899999999999996,0.83099999999999996,0.83399999999999996,0.83599999999999997,0.83799999999999997,0.84,0.84199999999999997,0.84499999999999997,0.84699999999999998,0.84899999999999998]
[55,0.85099999999999998,0.85399999999999998,0.85599999999999998,0.85799999999999998,0.86,0.86299999999999999,0.86499999999999999,0.86699999999999999,0.87,0.872,0.874,0.877]
[56,0.879,0.88100000000000001,0.88400000000000001,0.88600000000000001,0.88800000000000001,0.89100000000000001,0.89300000000000002,0.89600000000000002,0.89800000000000002,0.9,0.90300000000000002,0.90500000000000003]
[57,0.90800000000000003,0.91,0.91300000000000003,0.91500000000000004,0.91800000000000004,0.92,0.92300000000000004,0.92500000000000004,0.92800000000000005,0.93,0.93300000000000005,0.93500000000000005]
[58,0.93799999999999994,0.94,0.94299999999999995,0.94499999999999995,0.94799999999999995,0.95099999999999996,0.95299999999999996,0.95599999999999996,0.95799999999999996,0.96099999999999997,0.96399999999999997,0.96599999999999997]
[59,0.96899999999999997,0.97199999999999998,0.97399999999999998,0.97699999999999998,0.98,0.98199999999999998,0.98499999999999999,0.98799999999999999,0.99099999999999999,0.99299999999999999,0.996,0.999]

{"sheet":"factors - classic","index":4,"n_rows":126,"n_cols":14,"rows_kept":126,"cut":false,"hidden":true,"merged":[]}
[null,"Pension for self (note: this option not available)",null,null,null,null,"Pension for self + partner"]
[null,"lump sum",null,"periodicals",null,null,"lump sum from Jul 2012","periodicals"]
["Age last birthday","Male","female","Male","female",null,"unisex","unisex",null,"no of 1 Aprils to NPA",null,null,null,"ret ages"]
[16,2.73,2.85,2.8,2.92,null,null,null,null,0,1,null,null,50]
[17,2.86,2.99,2.93,3.07,null,4.1500000000000004,6.01,null,1,1.02,null,null,51]
[18,3,3.14,3.08,3.22,null,4.33,6.23,null,2,1.04,null,null,52]
[19,3.16,3.3,3.23,3.38,null,4.51,6.46,null,3,1.06,null,null,53]
[20,3.32,3.46,3.4,3.55,null,4.7,6.69,null,4,1.08,null,null,54]
[21,3.48,3.64,3.56,3.73,null,4.9000000000000004,6.93,null,5,1.1000000000000001,null,null,55]
[22,3.65,3.82,3.74,3.91,null,5.0999999999999996,7.17,null,6,1.1299999999999999,null,null,56]
[23,3.84,4,3.93,4.0999999999999996,null,5.32,7.42,null,7,1.1499999999999999,null,null,57]
[24,4.0199999999999996,4.2,4.12,4.3,null,5.54,7.68,null,8,1.17,null,null,58]
[25,4.22,4.41,4.32,4.5199999999999996,null,5.78,7.96,null,9,1.2,null,null,59]
[26,4.43,4.63,4.54,4.75,null,6.02,8.23,null,10,1.22,null,null,60]
[27,4.6500000000000004,4.8600000000000003,4.7699999999999996,4.9800000000000004,null,6.27,8.52,null,11,1.24,null,null,61]
[28,4.88,5.09,5,5.22,null,6.54,8.82,null,12,1.27,null,null,62]
[29,5.12,5.35,5.25,5.48,null,6.81,9.1300000000000008,null,13,1.29,null,null,63]
[30,5.37,5.61,5.5,5.75,null,7.1,9.4600000000000009,null,14,1.32,null,null,64]
[31,5.64,5.88,5.78,6.03,null,7.4,9.7799999999999994,null,15,1.35,null,null,65]
[32,5.91,6.17,6.06,6.32,null,7.71,10.130000000000001,null,16,1.37,null,null,66]
[33,6.2,6.47,6.35,6.63,null,8.0299999999999994,10.49,null,17,1.4,null,null,67]
[34,6.5,6.79,6.66,6.96,null,8.3699999999999992,10.85,null,18,1.43,null,null,68]
[35,6.82,7.11,6.99,7.29,null,8.7200000000000006,11.23,null,19,1.46,null,null,69]
[36,7.15,7.46,7.33,7.64,null,9.09,11.62,null,20,1.49,null,null,70]
[37,7.5,7.83,7.69,8.02,null,9.4700000000000006,12.03,null,21,1.52,null,null,71]
[38,7.87,8.1999999999999993,8.06,8.4,null,9.86,12.44,null,22,1.55,null,null,72]
[39,8.25,8.6,8.4499999999999993,8.82,null,10.28,12.87,null,23,1.58,null,null,73]
[40,8.65,9.02,8.86,9.24,null,10.71,13.32,null,24,1.61,null,null,74]
[41,9.07,9.4600000000000009,9.2899999999999991,9.69,null,11.15,13.79,null,25,1.64,null,null,75]
[42,9.51,9.91,9.74,10.16,null,11.62,14.27,null,26,1.67]
[43,9.98,10.4,10.220000000000001,10.65,null,12.11,14.77,null,27,1.71]
[44,10.46,10.9,10.72,11.17,null,12.62,15.28,null,28,1.74]
[45,10.97,11.43,11.25,11.72,null,13.14,15.82,null,29,1.78]
[46,11.5,12,11.79,12.29,null,13.7,16.37,null,30,1.81]
[47,12.07,12.58,12.37,12.89,null,14.27,16.940000000000001,null,31,1.85]
[48,12.66,13.19,12.98,13.52,null,14.87,17.53,null,32,1.88]
[49,13.29,13.84,13.61,14.18,null,15.49,18.149999999999999,null,33,1.92]
[50,13.94,14.52,14.28,14.88,null,16.149999999999999,18.78,null,34,1.96]
[51,14.63,15.24,14.99,15.61,null,16.829999999999998,19.440000000000001,null,35,2]
[52,15.35,15.99,15.73,16.38,null,17.54,20.12,null,36,2.04]
{"$rows_left_out":86}