{"text_format":"1","workbook":"xlsx","n_sheets":6,"sheets":["Guidance","Inputs and Results","Calculations_hide","AlphaERF_hide","SPD Calculations_hide","Cover Sheet_hide"],"not_rendered":{"charts":0,"images":6,"macros":1,"external_links":0,"defined_names":197,"comments":1,"pivot_tables":0},"unopened":[],"bounds":{"document_bytes":16777216,"sheet_cells":100000,"rows_first":2000,"rows_last":500,"rows_between":2000,"halvings":0,"cell_chars":16384,"cell_head_chars":4096},"cells_cut":0,"cells_raw":0,"read":"whole","date_system":"1900"}

{"sheet":"Guidance","index":0,"n_rows":5,"n_cols":5,"rows_kept":5,"cut":false,"hidden":false,"merged":[[4,1,4,11],[0,4,2,11]]}
[null,{"$f":"\"                                                  \"&strToolName","v":"                                                  Early Retirement Estimator for classic, classic plus and premium"},null,null,{"$f":"strToolName","v":"Early Retirement Estimator for classic, classic plus and premium"}]
[]
[]
[]
[null,"The early retirement estimator – Principal Civil Service Pension Scheme (PCSPS), classic, classic plus, premium \n"]

{"sheet":"Inputs and Results","index":1,"n_rows":79,"n_cols":10,"rows_kept":79,"cut":false,"hidden":false,"merged":[[81,1,81,12],[77,1,77,12],[78,1,78,12],[76,1,76,12],[10,4,10,7],[66,1,66,12],[74,1,74,12],[75,1,75,12],[35,4,35,7],[43,4,43,7],[45,4,45,7],[49,4,49,7],[51,4,51,7],[62,4,62,7],[26,1,26,6],[27,1,27,6],[8,4,8,7],[6,4,6,7],[38,4,38,7],[17,4,17,7],[0,1,2,12],[4,1,4,6],[14,4,14,7],[16,4,16,7],[12,1,12,6],[13,1,13,6],[19,4,19,7],[6,8,6,12],[8,8,8,12],[10,8,10,12],[19,8,19,12],[72,1,72,12],[21,9,21,13],[22,9,22,13],[24,9,24,13],[58,4,58,7],[56,4,56,7],[61,1,61,6],[47,4,47,7],[28,4,28,7],[54,4,54,7],[37,1,37,6],[53,1,53,6],[40,4,40,7]]}
[null,{"$f":"strToolName","v":"Early Retirement Estimator for classic, classic plus and premium"}]
[]
[]
[]
[null,"Step 1 - Enter Your Details"]
[]
[null,null,null,"Name"]
[]
[null,null,null,"Date of birth",null,null,null,null,"Format : dd/mm/yyyy"]
[]
[null,null,null,"Planned retirement date",null,null,null,null,"Format : dd/mm/yyyy, must be on or after your 55th birthday."]
[]
[null,"Step 2 - Enter scheme, service and salary details"]
[null,"See your latest Annual Benefit Statement for these figures"]
[null,null,null,"Pension scheme","Select Pension Scheme"]
[]
[null,null,null,"Unreduced nuvos pension at planned retirement date",0]
[null,null,null,"Unreduced lump sum at planned retirement date",0]
[]
[null,null,null,"Pensionable salary",0,null,null,null,"Enter your most recent pensionable salary"]
[]
[null,null,null,"Pensionable service in years and days (classic and premium)",0,"years",null,0,{"$f":"IF(OR(uiStandardDays>1,uiStandardDays=0),\"days\",\"day\")","v":"days"},{"$f":"IF(AND(uiScheme<>\"classic plus\",bServiceGT45),errServiceGT45,\"\")","v":""}]
[null,null,null,"Pre 30 Sep 2002  Pensionable Service In Years and Days  (classic plus)",0,"years",null,0,"days"]
[]
[null,null,null,"Post 30 Sep 2002  Pensionable Service In Years and Days  (classic plus)",0,"years",null,0,"days",{"$f":"IF(AND(uiScheme=\"classic plus\",bServiceGT45),errServiceGT45,\"\")","v":""}]
[]
[null,"Step 3 - Enter unreduced benefit details for your alpha scheme"]
[null,"See your latest Annual Benefit Statement for these figures"]
[null,null,null,"Unreduced pension at planned retirement date",0]
[]
[]
[]
[]
[null,"Results"]
[]
[null,null,null,{"$f":"\"Age at planned retirement \"","v":"Age at planned retirement "},{"$f":"resAgeERD","v":"Error"}]
[]
[null,{"$f":"\"Scheme  : \"&Scheme&\"\"","v":"Scheme  : Select Pension Scheme"}]
[null,null,null,"Normal pension age",{"$f":"resNPA","v":60}]
[]
[null,null,null,"Unreduced Lump Sum at normal pension age",{"$f":"resLS","v":"Error"}]
[]
[]
[null,null,null,{"$f":"\"Actuarially reduced pension at planned retirement age\"","v":"Actuarially reduced pension at planned retirement age"},{"$f":"IF(bP1OverallError,_errOverallShort,resARPen)","v":"Error"}]
[]
[null,null,null,{"$f":"\"Actuarially reduced lump sum at planned retirement age\"","v":"Actuarially reduced lump sum at planned retirement age"},{"$f":"IF(bP1OverallError,_errOverallShort,resARLS)","v":"Error"}]
[]
[null,null,null,{"$f":"\"Cost of buying out actuarial reduction to pension - 100 %\"","v":"Cost of buying out actuarial reduction to pension - 100 %"},{"$f":"IF(bP1OverallError,_errOverallShort,resCostARRPen)","v":"Error"}]
[]
[null,null,null,{"$f":"\"Cost of buying out actuarial reduction to lump sum - 100 %\"","v":"Cost of buying out actuarial reduction to lump sum - 100 %"},{"$f":"Calculations_hide!C144","v":"Error"}]
[]
[null,null,null,{"$f":"\"Cost of buying out overall Part 1 actuarial reduction - 100 %\"","v":"Cost of buying out overall Part 1 actuarial reduction - 100 %"},{"$f":"resP1CostTotal","v":"Error"}]
[]
[null,"alpha Scheme"]
[null,null,null,{"$f":"\" State Pension Age\"","v":" State Pension Age"},{"$f":"resSPA","v":"Error"}]
[]
[null,null,null,{"$f":"\"Actuarially reduced pension\"","v":"Actuarially reduced pension"},{"$f":"IF(bP2OverallError,_errOverallShort,resARPen_alpha)","v":"Error"}]
[]
[null,null,null,{"$f":"\"Cost of buying out actuarial reduction to pension - 100 %\"","v":"Cost of buying out actuarial reduction to pension - 100 %"},{"$f":"IF(bP2OverallError,_errOverallShort,resCostARRPen_alpha)","v":"Error"}]
[]
[]
[null,"Total Costs "]
[null,null,null,"Cost of buying out overall actuarial reduction - 100 %",{"$f":"resCostTotal","v":0}]
[]
[]
[null,{"$f":"IF(B67=\"\",\"\",\"Messages\")","v":""}]
[null,{"$f":"errFinal","v":""}]
[]
[]
[]
[]
[null,"Important notes:"]
[null,"•      You should not enter into any financial commitments on the strength of these figures.\n•      Benefits are only permitted to be taken before your normal pension age if the pension is sufficient to pay any Guaranteed Minimum Pension. This calculator does not carry out this test so you may not be allowed to retire and take your benefits at the date you have selected. \n•      Any additional pension you may be purchasing through additional voluntary contributions is not taken in account by this calculator \n•      The estimate is worked out using current actuarial reduction factors. These are reviewed from time to time and may change in the future. Your benefits at actual retirement date will be worked out using the factors current at that time and could be higher or lower than produced today.\n•      The calculator cannot be used if you have any period of membership where you worked part time.\n•      If you have any non-reckonable service due to sickness or other absences this should be deducted from the reckonable service you enter into the service field of the calculator. The estimate will be over stated if you do not do this.\n•      The calculator does not perform any sort of eligibility check so this is not a guarantee that early retirement benefits are available.\n•      Pension benefits are only payable in accordance with the rules of the scheme and this estimate does not override these.  If there is a difference between this estimate and the rules of the scheme or what is payable under the rules, the rules of the scheme will apply.  The rules of the scheme can be found here: www.civilservicepensionscheme.org.uk/about-us/scheme-rules \n•      If you have not paid all the contributions due during your membership of the scheme the missing contributions will be deducted from the benefits that are paid so you may receive less than is indicated here.\n•      The maximum service that can count towards benefits in the scheme is 45 years.\n•      If you are looking to retire after 31 March 2015 and you are due to move to the new alpha scheme before your proposed retirement date this calculator will not produce accurate results.\n•      If you have a pension sharing order attached to your pension benefits this will not be taken into account by this calculator.\n•      If you have elected for Scheme Pays in respect of a tax liability this will not be taken into account by this calculator.\n•      If you are a pension credit member this calculator is not applicable.  \n•      If your benefits exceed the Annual Allowance or Lifetime Allowance limits you may have a tax charge to pay and this is not included in this estimate.  \n•      If you intend to retire soon and you want an accurate pension forecast you should contact your HR department and request a retirement quotation."]
[null,"      "]
[null,{"$f":"msgPrint","v":"13:49,  10 May 2019 .  "}]
[null,{"$f":"msgFileName","v":"Filename : \\\\mcclprdwssm085\\Users$\\VaughaJ\\My Documents\\[Copy of early-retirement-v1-1-april-2019. LOCKEDxlsm.xlsm"}]
[null,{"$f":"msgVersionNumber","v":"Calculator Version Number : 1.1.  "}]
[null,{"$f":"msgExpiration","v":"Tool expires on 01/04/2099.  "}]
[null,{"$f":"msgPDFSaveLocation","v":"PDF saved to : C:\\Users\\rob\\Documents\\RPMConsulting\\Documents\\Client Work\\myCSP\\Excel Tools\\Actuarial Reduction\\ER tool\\Review 29082014 V0.9\\ER___2982014.pdf"}]

{"sheet":"Calculations_hide","index":2,"n_rows":348,"n_cols":18,"rows_kept":348,"cut":false,"hidden":true,"merged":[[3,2,3,6],[4,2,4,6],[12,1,12,4]]}
[null,null,{"$f":"strToolName","v":"Early Retirement Estimator for classic, classic plus and premium"}]
[]
[]
[null,"Description","This sheet is intended to be used by ADMINISTRATION staff as a backend tool.  It is not expected that this will be exposed to the public users.  This tool was developed quickly and include a lot of redundant code that was left in so as not to break existing functionality and so speed up the development process.  This should be backed out at some point in the future."]
[null,"Schemes","Part 1.  "]
[]
[]
[]
[null,null,{"$f":"strToolName&\" - Instructions\"","v":"Early Retirement Estimator for classic, classic plus and premium - Instructions"}]
[null,null,null,null,null,null,"Key to cell colours:"]
[null,null,null,null,null,null,"User inputs from input sheet (yellow)"]
[null,"How to use this Actuarial Reduce Buy-out tool",null,null,null,null,"Work Variable (orange)"]
[null,"Please provide details all detail sin the input section, these inputs are fed in from the sheet 'Inputs and Results'",null,null,null,null,"Output (green)"]
[null,"Resolve any errors generated.",null,null,null,null,"Messages (pink)"]
[null,null,null,null,null,null,"System Tables Values (blue)"]
[null,null,null,null,null,null,"System Variable (dark green)"]
[null,null,null,null,null,null,"Error In Cell (red)"]
[]
[]
[null,null,{"$f":"strToolName&\" - Inputs\"","v":"Early Retirement Estimator for classic, classic plus and premium - Inputs"}]
[]
[]
[]
[null," Employee Details"]
[null,"Name",{"$f":"uiName","v":0},"Name"]
[]
[null,"Date of birth",{"$f":"uiDOB","v":"00:00:00"},"DOB"]
[]
[null,"Planned retirement date",{"$f":"uiERetDate","v":"00:00:00"},"ERetDate"]
[]
[]
[null,"Part 1 Details"]
[]
[null,"Pension scheme",{"$f":"uiScheme","v":"Select Pension Scheme"},"Scheme"]
[]
[null,"Pensionable Salary",{"$f":"uiPensionableSalary","v":0},"PensionableSalary"]
[]
[null,"Standard Pensionable Service Years (Classic/Premium)",{"$f":"uiStandardYears","v":0},"StandardYears"]
[]
[null,"Standard Pensionable Service Days (Classic/Premium)",{"$f":"uiStandardDays","v":0},"StandardDays"]
[]
[null,"Pre 2002 Pensionable Service Years (Classic Plus)",{"$f":"uiPre2002Years","v":0},"Pre2002Years"]
[]
[null,"Pre 2002 Pensionable Service Days (Classic Plus)",{"$f":"uiPre2002Days","v":0},"Pre2002Days"]
[]
[null,"Post 2002 Pensionable Service Years (Classic Plus)",{"$f":"uiPost2002Years","v":0},"Post2002Years"]
[]
[null,"Post 2002 Pensionable Service Days (Classic Plus)",{"$f":"uiPost2002Days","v":0},"Post2002Days"]
[]
[null,"Total Years and Days",{"$f":"IF(OR(Scheme=\"classic\",LEFT(Scheme,7)=\"premium\"),StandardYears+StandardDays/365,Pre2002Years+Post2002Years+Pre2002Days/365+Post2002Days/365)","v":0},"TotalService"]
[]
[]
[null,"Unreduced Pension Calcualtions"]
[]
[null,"Unreduced Classic pension based on FS service (80ths)",{"$f":"PensionableSalary*IF(Scheme=\"classic\",(StandardYears*365+StandardDays)/29200,0)","v":0},"UnReducedClassicPenRetDate"]
[]
[null,"Unreduced ClassicPlus  pension based on FS service (80ths/60ths)",{"$f":"PensionableSalary*IF(Scheme=\"classic plus\",(Pre2002Years*365+Pre2002Days)/29200+(Post2002Years*365+Post2002Days)/21900,0)","v":0},"UnReducedClassicPlusPenRetDate"]
[]
[null,"Unreduced Premium pension based on FS service (60ths)",{"$f":"PensionableSalary*IF(LEFT(Scheme,7)=\"premium\",(StandardYears*365+StandardDays)/21900,0)","v":0},"UnReducedPremiumPenRetDate"]
[]
[null,"Unreduced nuvos pension based on FS service (60ths)",{"$f":"IF(Scheme=\"nuvos\",uiUnreducednuvosPenRetDate,0)","v":0},"UnreducednuvosPenRetDate"]
[]
[]
[null,"Unreduced pension at planned retirement date",{"$f":"MAX(UnReducedClassicPenRetDate,UnReducedClassicPlusPenRetDate,UnReducedPremiumPenRetDate,UnreducednuvosPenRetDate)","v":0},"UnReducedPenRetDate"]
[]
[null,"Unreduced lump sum at planned retirement date",{"$f":"3*IF(Scheme=\"classic plus\",(Pre2002Years*365+Pre2002Days)/29200*PensionableSalary,IF(Scheme=\"classic\",UnReducedClassicPenRetDate,0))","v":0},"UnReducedLSRetDate"]
[]
[null,"Alpha Details"]
[null,"Alpha Unreduced pension at planned retirement date",{"$f":"uiUnreducedPenRetDate_alpha","v":0},"UnReducedPenRetDate_Alpha"]
[]
[]
[]
[null,null,{"$f":"strToolName&\" - Calculations\"","v":"Early Retirement Estimator for classic, classic plus and premium - Calculations"}]
[]
[]
[]
[]
[null,"Part 1 Calcualtions",null,null,null,"alpha Calculations"]
[null,"Age Calc",null,null,null,"SPD Calcs"]
[null,"Part 1 Pension Age",{"$f":"VLOOKUP(Scheme,tabNPA,2,0)","v":60},"dNPA",null,"State Pension Date",{"$f":"resdaySPD","v":"00:00:00"},"=resdaySPD"]
[null,"Age at early retirement date",{"$f":"ROUND(YEAR(ERetDate)-YEAR(DOB)+(ERetDate-DATE(YEAR(ERetDate),MONTH(DOB),DAY(DOB)))/365,4)","v":0},"dAgeERD",null,"SPA Y+M (Y+CM/12)",{"$f":"resdSPA_CYM","v":0},"=resdSPA_CYM"]
[null,"Age at miniumum ERA",{"$f":"DATE(YEAR(DOB)+dMinERA,MONTH(DOB),DAY(DOB))","v":"1954-12-31"},"dayERA",null,"SPA CY",{"$f":"resdSPA_CY","v":0},"=resdSPA_CY"]
[null,null,null,null,null,"SPA Y+M - CY",{"$f":"ROUND((resdSPA_CYM-resdSPA_CY)*12,0)","v":0},"=resdSPA_CYM-resdSPA_CY"]
[]
[null,"Factors"]
[null,"Lookup",null,null,null,"Alpha ARR factors and SPA Interpolation"]
[null,"Years Dif",{"$f":"SUM(YEAR(ERetDate)-YEAR(DOB))","v":0},"yrsDiffDOBERD",null,{"$f":"\"ERF at \"&resdSPA_CY&\"_\"&yrsAdjust&\"Y\"&iAgeColLookupMonths&\"M\"","v":"ERF at 0_0Y0M"},{"$f":"VLOOKUP(resdSPA_CY&\"_\"&yrsAdjust&\"Y\"&iAgeColLookupMonths&\"M\",tabAlphaERF,2,0)","v":{"$error":"#N/A"}},"P2ERFTableX"]
[null,"Months Dif",{"$f":"SUM(MONTH(ERetDate)-MONTH(DOB))","v":0},"mthsDiffDOBERD",null,{"$f":"\"ERF at \"&resdSPA_CY+1&\"_\"&yrsAdjust+1&\"Y\"&iAgeColLookupMonths&\"M\"","v":"ERF at 1_1Y0M"},{"$f":"VLOOKUP(resdSPA_CY+1&\"_\"&yrsAdjust+1&\"Y\"&iAgeColLookupMonths&\"M\",tabAlphaERF,2,0)","v":{"$error":"#N/A"}},"P2ERFTableX1"]
[null,"Days Dif",{"$f":"SUM(DAY(ERetDate)-DAY(DOB))","v":0},"daysDiffDOBERD",null,"Alpha pension ERF",{"$f":"ROUND((G83*P2ERFTableX1+(12-G83)*P2ERFTableX)/12,4)","v":{"$error":"#N/A"}},"ERFPen_Alpha"]
[null,"Months Adjustment",{"$f":"IF((daysDiffDOBERD<0),(mthsDiffDOBERD-1),mthsDiffDOBERD)","v":0},"mthsAdjust"]
[null,"Years Adjustment",{"$f":"IF((C90<0),(yrsDiffDOBERD-1),yrsDiffDOBERD)","v":0},"yrsAdjust"]
[null,"Age Years column lookup (Age 60), Table starts at 50",{"$f":"yrsAdjust-48","v":-48},"iAgeColLookupYears_50"]
[null,"Age Years column lookup (Age 65), Table starts at 55",{"$f":"iAgeColLookupYears_50-5","v":-53},"iAgeColLookupYears_55"]
[null,"Age Months column lookup",{"$f":"IF((mthsAdjust<0),(mthsAdjust+12),mthsAdjust)","v":0},"iAgeColLookupMonths"]
[null,"Age Used",{"$f":"yrsAdjust&\" Years \"&IF(iAgeColLookupMonths>0,iAgeColLookupMonths&\" Month\",\"\")&IF(iAgeColLookupMonths>1,\"s\",\"\")","v":"0 Years "},"strAgeUsed"]
[]
[null,"ARR factors "]
[null,"C, C+, P pension ERF",{"$f":"IF((dAgeERD<dNPA),VLOOKUP(iAgeColLookupMonths,tabARRPenC_CP_P,iAgeColLookupYears_50),1)","v":{"$error":"#VALUE!"}},"ERFPen_60"]
[null,"C, C+, P lump sum  ERF",{"$f":"IF((dAgeERD<dNPA),VLOOKUP(iAgeColLookupMonths,tabARRLSC_CP,iAgeColLookupYears_50),1)","v":{"$error":"#VALUE!"}},"ERFLS_60"]
[null,"P - NPA65 pension  ERF",{"$f":"IF((dAgeERD<dNPA),VLOOKUP(iAgeColLookupMonths,tabARRPenP,iAgeColLookupYears_50),1)","v":{"$error":"#VALUE!"}},"ERFPen_65"]
[]
[null,"Complete Years to pension age",{"$f":"MAX(0,dNPA-dAgeERD)","v":60},"yrsEarly","Validaiton on age range, -15"]
[null,"Years at 5%",{"$f":"MIN(yrsEarly,5)","v":5},"yrsAt5pc"]
[null,"Years at 3% (6 to 65-50) years",{"$f":"MAX(0,MIN(yrsEarly-5,65-dMinERA))","v":10},"yrsAt3%"]
[null,"Nuvos pension ERF",{"$f":"ROUND((yrsAt5pc*0.05)+(yrsAt3*0.03),3)","v":0.55000000000000004},"ERFPen_nuvos"]
[]
[null,"Early Retirement Benefits, rounded for results purposes",null,null,null,"Alpha Early Retirement Benefits, rounded for results purposes"]
[null,"C, C+, P pension benefits",{"$f":"ROUND((UnReducedPenRetDate*ERFPen_60),2)","v":{"$error":"#VALUE!"}},"ARRPenBen_60",null,"Alpha pension benefits",{"$f":"ROUND((UnReducedPenRetDate_Alpha*ERFPen_Alpha),2)","v":{"$error":"#N/A"}},"ARRPenBen_Alpha"]
[null,"C, C+, P lump sum benefits",{"$f":"ROUND((UnReducedLSRetDate*ERFLS_60),2)","v":{"$error":"#VALUE!"}},"ARRLSBen_60"]
[null,"P - NPA65 pension benefits",{"$f":"ROUND((UnReducedPenRetDate*ERFPen_65),2)","v":{"$error":"#VALUE!"}},"ARRPenBen_65"]
[null,"Nuvos pension benefits",{"$f":"ROUND((UnReducedPenRetDate*(1-ERFPen_nuvos)),2)","v":0},"ARRPenBen_nuvos"]
[]
[null,"Pension buy-out factors",null,null,null,"Alpha Pension buy-out factors  and SPA Interpolation"]
[null,"C, C+, P buyout ",{"$f":"VLOOKUP(iAgeColLookupMonths,tabARRBuyout_PA60,iAgeColLookupYears_50)","v":{"$error":"#VALUE!"}},"BuyOutF_60",null,{"$f":"\"BuyOut factor at  \"&resdSPA_CY&\"_\"&yrsAdjust&\"Y\"&iAgeColLookupMonths&\"M\"","v":"BuyOut factor at  0_0Y0M"},{"$f":"VLOOKUP(resdSPA_CY&\"_\"&yrsAdjust&\"Y\"&iAgeColLookupMonths&\"M\",tabAlphaBuyout,2,0)","v":{"$error":"#N/A"}},"P2BuyOutX"]
[null,"P - NPA65  buyout ",{"$f":"VLOOKUP(iAgeColLookupMonths,tabARRBuyoutP_PA65,iAgeColLookupYears_55)","v":{"$error":"#VALUE!"}},"BuyOutF_65",null,{"$f":"\"Buyout factor at \"&resdSPA_CY+1&\"_\"&yrsAdjust+1&\"Y\"&iAgeColLookupMonths&\"M\"","v":"Buyout factor at 1_1Y0M"},{"$f":"VLOOKUP(resdSPA_CY+1&\"_\"&yrsAdjust+1&\"Y\"&iAgeColLookupMonths&\"M\",tabAlphaBuyout,2,0)","v":{"$error":"#N/A"}},"P2BuyOutX1"]
[null,"N  buyout ",{"$f":"VLOOKUP(iAgeColLookupMonths,tabARRBuyout_nuvos,iAgeColLookupYears_55)","v":{"$error":"#VALUE!"}},"BuyOutF_Nuvos",null,"Alpha buyout ",{"$f":"ROUND((G83*P2BuyOutX1+(12-G83)*P2BuyOutX)/12,4)","v":{"$error":"#N/A"}},"BuyOutF_Alpha"]
[]
[]
[null,"Cost of pension buy-out, rounded for results purposes",null,null,null,"Cost of pension buy-out, rounded for results purposes"]
[null,"C, C+, P  buyout cost",{"$f":"ROUND((BuyOutF_60*UnReducedPenRetDate),2)","v":{"$error":"#VALUE!"}},"CostOfBuyout_60",null,"Alpha buyout cost",{"$f":"ROUND((BuyOutF_Alpha*UnReducedPenRetDate_Alpha),2)","v":{"$error":"#N/A"}},"CostOfBuyout_alpha"]
[null,"C, C+ Lumps Sum buyout cost",{"$f":"ROUND(UnReducedLSRetDate*(1-ERFLS_60),2)","v":{"$error":"#VALUE!"}},"CostARRLS"]
[null,"P - NPA65  buyout cost",{"$f":"ROUND((BuyOutF_65*UnReducedPenRetDate),2)","v":{"$error":"#VALUE!"}},"CostOfBuyout_65"]
[null,"N  buyout cost",{"$f":"ROUND((BuyOutF_Nuvos*UnReducedPenRetDate),2)","v":{"$error":"#VALUE!"}},"CostOfBuyout_nuvos"]
[]
[]
[]
[]
[null,null,{"$f":"strToolName&\" - Results\"","v":"Early Retirement Estimator for classic, classic plus and premium - Results"}]
[]
[]
[null,"Age at planned retirement",{"$f":"IF(OR(dAgeERD<=0,ISERROR(dAgeERD)),errError,strAgeUsed)","v":"Error"},"resAgeERD"]
[]
[null,"Part 1 Results",null,null,null,"Alpha Results"]
[null,"Pension age",{"$f":"IF(ISERROR(dNPA),errError,dNPA)","v":60},"resNPA",null,"State Pension age",{"$f":"IF(ISERROR(resstrSPA),errError,resstrSPA)","v":"Error"},"resSPA"]
[]
[null,"Actuarially reduced pension",{"$f":"IF((Scheme=\"nuvos\"),IF(ISERROR(ARRPenBen_nuvos),errError,ARRPenBen_nuvos),\nIF((Scheme=\"premium (pension age 65)\"),IF(ISERROR(ARRPenBen_65),errError,ARRPenBen_65),\nIF(ISERROR(ARRPenBen_60),errError,ARRPenBen_60)))","v":"Error"},"resARPen",null,"Actuarially reduced pension",{"$f":"IF(ISERROR(ARRPenBen_Alpha),errError,ARRPenBen_nuvos)","v":"Error"},"resARPen_alpha"]
[]
[null,"(C/C+/P) Unreduced Lump sum",{"$f":"IF(OR(Scheme=\"classic\",Scheme=\"classic plus\"),UnReducedLSRetDate,errError)","v":"Error"},"resLS"]
[]
[null,"(C/C+/P) Actuarially reduced lump sum",{"$f":"IF(OR(Scheme=\"classic\",Scheme=\"classic plus\"),IF(ISERROR(ARRLSBen_60),errError,ARRLSBen_60),errError)","v":"Error"},"resARLS"]
[]
[null,"Cost of buying out actuarial reduction to pension - 100 %",{"$f":"IF(Scheme=\"nuvos\",IF(ISERROR(CostOfBuyout_nuvos),errError,CostOfBuyout_nuvos),\nIF((Scheme=\"premium (pension age 65)\"),IF(ISERROR(CostOfBuyout_65),errError,CostOfBuyout_65),\nIF(ISERROR(CostOfBuyout_60),errError,CostOfBuyout_60)))","v":"Error"},"resCostARRPen",null,"Cost of buying out actuarial reduction to pension - 100 %",{"$f":"IF(ISERROR(CostOfBuyout_alpha),errError,CostOfBuyout_alpha)","v":"Error"},"resCostARRPen_alpha"]
[]
[null,"(C/C+) Cost of buying out actuarial reduction to lump sum - 100 %",{"$f":"IF(OR(Scheme=\"classic\",Scheme=\"classic plus\"),IF(ISERROR(CostARRLS),errError,CostARRLS),errError)","v":"Error"},"resCostARRLS"]
[]
[null,"Part 1 Cost of buying out overall actuarial reduction - 100 %",{"$f":"IF(bC_CPMarker,IF(resCostARRPen=errError,errError,resCostARRPen),IF(OR(resCostARRPen=errError,resCostARRLS=errError),errError,resCostARRPen+resCostARRLS))","v":"Error"},"resP1CostTotal",null,"Cost of buying out overall actuarial reduction - 100 %",{"$f":"IF(ISERROR(resCostARRPen_alpha),errError,resCostARRPen_alpha)","v":"Error"},"resCostTotal_alpha"]
[]
[null,"Total Costs"]
[null,"Cost of buying out actuarial reduction to pension - 100 %",{"$f":"IF(bP1OverallError,0,IF(resP1CostTotal=errError,0,IF(bP1NA=FALSE,resP1CostTotal,0)))+IF(bP2OverallError,0,IF(resCostTotal_alpha=errError,0,IF(bAlphaMarker=FALSE,resCostTotal_alpha,0)))","v":0},"resCostTotal"]
[]
[null,"Part 1 NA marker used in UI, True hides cells",{"$f":"IF(Scheme=INDEX(tabSchemeList,1),TRUE,FALSE)","v":true},"bP1NA"]
[null,"Classic/Premium if Classic or Premium = TRUE",{"$f":"IF(OR(Scheme=\"classic\",LEFT(Scheme,7)=\"premium\"),TRUE,FALSE)","v":false},"bC_Pmarker"]
[null,"Classic/Classic Plus marker used in UI, True hides cells",{"$f":"IF(OR(Scheme=\"classic\", Scheme=\"classic plus\"),FALSE,TRUE)","v":true},"bC_CPMarker"]
[null,"Nuvos Marker",{"$f":"IF(OR(Scheme=\"classic\", Scheme=\"classic plus\",LEFT(Scheme,7)=\"premium\"),FALSE,TRUE)","v":true},"bFSMarker"]
[null,"Alpha Marker, True Hides Cells",{"$f":"IF(UnReducedPenRetDate_Alpha>0,FALSE,TRUE)","v":true},"bAlphaMarker"]
[]
[]
[null,null,"CSCS - Business Assumptions"]
[]
[]
[null,"Business Assumptions"]
[]
[null,"Business assumptions","Value","Name"]
[null,"Miniumum Allowable Ret Age",55,"dMinERA"]
[]
[]
[]
[]
[]
[]
[]
[]
[]
[]
[null,null,{"$f":"strToolName&\" - System Variables\"","v":"Early Retirement Estimator for classic, classic plus and premium - System Variables"}]
[]
[]
[null,"Version Number",1.1000000000000001,"VersionNumber"]
[null,"Security Classification","Unclassified","SecurityClassification"]
[null,"Tool Name","Early Retirement Estimator for classic, classic plus and premium","strToolName"]
[null,"Today's Date",{"$f":"TODAY()","v":"2019-05-10"},"dayToday"]
[null,"Tool Expiry Date","2099-04-01","dayExpiry"]
[]
[]
[]
[]
[null,null,"CSCS - Error Checking"]
[]
[]
[null,"Part 1 Error Checking",null,null,null,"Part 2 Error Checking"]
[null,"Error TBC",null,null,null,"Error TBC"]
[null,"Total Service > 45 Years",{"$f":"IF(TotalService>45,TRUE,FALSE)","v":false},"bServiceGT45",null,"Error TBC"]
[null,"Part 1 Age/NPA out of range",{"$f":"IF(OR(AND(ISERROR(ERFPen_65),OR(\"premium (pension age 65)\"=\"nuvos\",\"premium (pension age 65)\"=\"premium (pension age 65)\")),AND(ISERROR(ERFPen_60),OR(Scheme = \"classic\",Scheme = \"classic plus\",Scheme = \"premium (pension age 60)\" ))),TRUE,FALSE)","v":true},"bTableValueNotFound",null,"Part 2 Age/NPA out of range",{"$f":"IF(ISERROR(ERFPen_Alpha),TRUE,FALSE)","v":true},"bP2TableValueNotFound"]
[null,"Over Part 1 Pension Age",{"$f":"IF(ISERROR(dAgeERD<dNPA),FALSE,IF(dAgeERD<dNPA,FALSE,TRUE))","v":false},"bOverPA",null,"Over Part 2 Pension Age",{"$f":"IF((dAgeERD<resdSPA_CY),FALSE,TRUE)","v":true},"bP2OverPA"]
[null,"Expiration (FALSE=OK)",{"$f":"IF(dayToday>dayExpiry,TRUE,FALSE)","v":false},"bExpiryError",null,"Expiration (FALSE=OK)",{"$f":"IF(dayToday>dayExpiry,TRUE,FALSE)","v":false}]
[null,"Version (FALSE=OK)",{"$f":"IF(VersionNumber<>MAX(tabVersion),TRUE,FALSE)","v":false},"bVersionError",null,"Version (FALSE=OK)",{"$f":"IF(VersionNumber<>MAX(tabVersion),TRUE,FALSE)","v":false}]
[]
[null,"Part 1 Overall Error (FALSE=OK)",{"$f":"IF(OR(bExpiryError,bVersionError,bTableValueNotFound,bOverPA,bServiceGT45),TRUE,FALSE)","v":true},"bP1OverallError",null,"Part 2 Overall Error (FALSE=OK)",{"$f":"IF(OR(bExpiryError,bP2TableValueNotFound,bVersionError,bP2OverPA),TRUE,FALSE)","v":true},"bP2OverallError"]
[]
[null,"Error Messages"]
[null,"Part 1 and Part 2",{"$f":"IF(AND(bP1NA=FALSE,bAlphaMarker=FALSE),IF(bP1OverallError=TRUE,_errP1Overall,\"\")&IF(bP2OverallError=TRUE,_errP2Overall,\"\")&IF(OR(bP1OverallError=TRUE,bP2OverallError=TRUE),\"\",msgCaveats),\"\")","v":""},"errP1P2"]
[null,"Part  1 only",{"$f":"IF(AND(bP1NA=FALSE,bAlphaMarker=TRUE),IF(bP1OverallError=TRUE,_errP1Overall,msgCaveats),\"\")&IF(bServiceGT45,errServiceGT45,\"\")","v":""},"errP1"]
[null,"Part 2 only",{"$f":"IF(AND(bP1NA=TRUE,bAlphaMarker=FALSE),IF(bP2OverallError=TRUE,_errP2Overall,msgCaveats),\"\")","v":""},"errP2"]
[null,"Final Message",{"$f":"errP1P2&errP1&errP2","v":""},"errFinal"]
[]
[]
[null,null,"CSCS - Errors and Messages"]
[]
[]
[null,"Error and other messages"]
[null,"General"]
[null,{"$f":"\"Scheme not allowed.  \"","v":"Scheme not allowed.  "},null,null,null,null,null,null,"_errScheme"]
[null,{"$f":"IF(bVersionError,\"Check Version Number.  \",\"\")","v":""},null,null,null,null,null,null,"_errVersion"]
[null,{"$f":"\"Tool expires on \"&TEXT(dayExpiry,\"dd/mm/yyyy\")&\".  \"","v":"Tool expires on 01/04/2099.  "},null,null,null,null,null,null,"msgExpiration"]
[null,{"$f":"IF(bExpiryError,\"Tool Expired on \"&TEXT(dayExpiry,\"dd/mm/yyyy\")&\" please contact MyCSP for a new copy.  \",\"\")","v":""},null,null,null,null,null,null,"_errExpiration"]
[null,{"$f":"_errExpiration&_errVersion&errTableValueNotFound&msgOverPA","v":"Table value out of range, check if age or early retirement age is allowable.  "},null,null,null,null,null,null,"_errP1Overall"]
[null,{"$f":"_errExpiration&_errVersion&errP2TableValueNotFound&msgP2OverPA&errServiceGT45","v":"P2 Table value out of range, check if age or early retirement age is allowable.  Over State Pension Age, so no actuarial reduction. Total Service over 45 Years."},null,null,null,null,null,null,"_errP2Overall"]
[null,{"$f":"\"Error\"","v":"Error"},null,null,null,null,null,null,"_errOverallShort"]
[null,"File not in correct location or filename incorrect, use correct version.  ",null,null,null,null,null,null,"_errLocation"]
[null,{"$f":"\"Security Classification: \"&SecurityClassification&\".  \"","v":"Security Classification: Unclassified.  "},null,null,null,null,null,null,"msgSecurityClassification"]
[null,{"$f":"\"\" &TEXT(NOW(),\"hh:mm,  dd mmm yyyy \")&\".  \"","v":"13:49,  10 May 2019 .  "},null,null,null,null,null,null,"msgPrint"]
[null,{"$f":"\"Calculator Version Number : \"&(TEXT(VersionNumber,\"0.0\"))&\".  \"","v":"Calculator Version Number : 1.1.  "},null,null,null,null,null,null,"msgVersionNumber"]
[null,{"$f":"\"Filename : \"&LEFT(CELL(\"filename\",strToolName),FIND(\"]\",CELL(\"filename\",strToolName))-1)","v":"Filename : \\\\mcclprdwssm085\\Users$\\VaughaJ\\My Documents\\[Copy of early-retirement-v1-1-april-2019. LOCKEDxlsm.xlsm"},null,null,null,null,null,null,"msgFileName"]
[null,"PDF saved to : C:\\Users\\rob\\Documents\\RPMConsulting\\Documents\\Client Work\\myCSP\\Excel Tools\\Actuarial Reduction\\ER tool\\Review 29082014 V0.9\\ER___2982014.pdf",null,null,null,null,null,null,"msgPDFSaveLocation"]
[null,{"$f":"IF(TRUE,\"\",CONCATENATE(\"The figures provided by this calculator are for illustration purposes only. Individuals should not enter into financial commitments based on the figures provided.  \",\"Please note: from April 2011, all Civil Service pensions (including any obtained by buying out an actuarial reduction) will increase annually in line with changes in the Consumer Prices Index (CPI), \",\" not the Retail Prices Index (RPI) as has been the case in the past.\"))","v":""},null,null,null,null,null,null,"msgCaveats"]
[null,"You must complete this field",null,null,null,null,null,null,"msgCompulsoryField"]
[null,{"$f":"IF(bOverPA,\"Over pension age, so no actuarial reduction.\",\"\")","v":""},null,null,null,null,null,null,"msgOverPA"]
[null,"Error",null,null,null,null,null,null,"errError"]
[{"$f":"IF(bVersionError,\"Check Version Number.  \",\"\")","v":""},{"$f":"IF(bTableValueNotFound,\"Table value out of range, check if age or early retirement age is allowable.  \",\"\")","v":"Table value out of range, check if age or early retirement age is allowable.  "},null,null,null,null,null,null,"errTableValueNotFound"]
[null,{"$f":"IF(bP2TableValueNotFound,\"P2 Table value out of range, check if age or early retirement age is allowable.  \",\"\")","v":"P2 Table value out of range, check if age or early retirement age is allowable.  "},null,null,null,null,null,null,"errP2TableValueNotFound"]
[null," Total Service over 45 Years.",null,null,null,null,null,null,"errServiceGT45"]
[null,{"$f":"IF(bP2OverPA,\"Over State Pension Age, so no actuarial reduction.\",\"\")","v":"Over State Pension Age, so no actuarial reduction."},null,null,null,null,null,null,"msgP2OverPA"]
[]
[]
[]
[null,null,{"$f":"strToolName&\" - Tables\"","v":"Early Retirement Estimator for classic, classic plus and premium - Tables"}]
[]
[]
[null,"Tables used in calculations/sheets"]
[null,null,null,"tabSchemeList, tabNPA"]
[null,"tabYesNo",null,"Scheme List","NPA"]
[null,"Yes/No",null,"Select Pension Scheme",60]
[null,"Yes",null,"classic",60]
[null,"No",null,"premium (pension age 60)",60]
[null,null,null,"classic plus",60]
[null,null,null,"premium (pension age 65)",65]
[null,null,null,"nuvos",65]
[null,null,null,"alpha","multiple"]
[null,"ERF"]
[]
[null,"tabARRPenC_CP_P","P1ER60PEN1"]
[null,"Actuarially reduced pension - classic/classic plus/premium"]
[null,null,50,51,52,53,54,55,56,57,58,59,60]
[null,0,0.65,0.67500000000000004,0.70099999999999996,0.73,0.76,0.79400000000000004,0.83,0.86799999999999999,0.91,0.95399999999999996,1]
[null,1,0.65200000000000002,0.67700000000000005,0.70399999999999996,0.73199999999999998,0.76300000000000001,0.79700000000000004,0.83299999999999996,0.872,0.91300000000000003,0.95799999999999996]
[null,2,0.65400000000000003,0.67900000000000005,0.70599999999999996,0.73499999999999999,0.76600000000000001,0.8,0.83599999999999997,0.875,0.91700000000000004,0.96199999999999997]
[null,3,0.65700000000000003,0.68100000000000005,0.70799999999999996,0.73699999999999999,0.76900000000000002,0.80300000000000005,0.83899999999999997,0.879,0.92100000000000004,0.96599999999999997]
[null,4,0.65900000000000003,0.68400000000000005,0.71099999999999997,0.74,0.77100000000000002,0.80600000000000005,0.84299999999999997,0.88200000000000001,0.92400000000000004,0.97]
[null,5,0.66100000000000003,0.68600000000000005,0.71299999999999997,0.74199999999999999,0.77400000000000002,0.80900000000000005,0.84599999999999997,0.88600000000000001,0.92800000000000005,0.97399999999999998]
[null,6,0.66300000000000003,0.68799999999999994,0.71499999999999997,0.745,0.77700000000000002,0.81200000000000006,0.84899999999999998,0.88900000000000001,0.93200000000000005,0.97799999999999998]
[null,7,0.66500000000000004,0.69,0.71799999999999997,0.748,0.78,0.81499999999999995,0.85199999999999998,0.89200000000000002,0.93600000000000005,0.98199999999999998]
[null,8,0.66700000000000004,0.69199999999999995,0.72,0.75,0.78300000000000003,0.81799999999999995,0.85499999999999998,0.89600000000000002,0.93899999999999995,0.98599999999999999]
[null,9,0.66900000000000004,0.69499999999999995,0.72199999999999998,0.753,0.78500000000000003,0.82099999999999995,0.85899999999999999,0.89900000000000002,0.94299999999999995,0.99]
[null,10,0.67100000000000004,0.69699999999999995,0.72499999999999998,0.755,0.78800000000000003,0.82399999999999995,0.86199999999999999,0.90300000000000002,0.94699999999999995,0.99399999999999999]
[null,11,0.67300000000000004,0.69899999999999995,0.72699999999999998,0.75800000000000001,0.79100000000000004,0.82699999999999996,0.86499999999999999,0.90600000000000003,0.95,0.998]
[]
[null,"tabARRLSC_CP","P1ER60LS1"]
[null,"Actuarially reduced lump sum - classic/classic plus"]
[null,null,50,51,52,53,54,55,56,57,58,59,60]
[null,0,0.79,0.80900000000000005,0.82799999999999996,0.84799999999999998,0.86799999999999999,0.88900000000000001,0.91,0.93200000000000005,0.95499999999999996,0.97799999999999998,1]
[null,1,0.79100000000000004,0.81,0.83,0.85,0.87,0.89100000000000001,0.91200000000000003,0.93400000000000005,0.95699999999999996,0.97899999999999998]
[null,2,0.79300000000000004,0.81200000000000006,0.83099999999999996,0.85099999999999998,0.872,0.89300000000000002,0.91400000000000003,0.93600000000000005,0.95799999999999996,0.98099999999999998]
[null,3,0.79400000000000004,0.81299999999999994,0.83299999999999996,0.85299999999999998,0.873,0.89400000000000002,0.91600000000000004,0.93799999999999994,0.96,0.98299999999999998]
[null,4,0.79600000000000004,0.81499999999999995,0.83499999999999996,0.85499999999999998,0.875,0.89600000000000002,0.91800000000000004,0.94,0.96199999999999997,0.98499999999999999]
[null,5,0.79800000000000004,0.81699999999999995,0.83599999999999997,0.85599999999999998,0.877,0.89800000000000002,0.91900000000000004,0.94199999999999995,0.96399999999999997,0.98699999999999999]
[null,6,0.79900000000000004,0.81799999999999995,0.83799999999999997,0.85799999999999998,0.879,0.9,0.92100000000000004,0.94299999999999995,0.96599999999999997,0.98899999999999999]
[null,7,0.80100000000000005,0.82,0.84,0.86,0.88,0.90200000000000002,0.92300000000000004,0.94499999999999995,0.96799999999999997,0.99099999999999999]
[null,8,0.80200000000000005,0.82199999999999995,0.84099999999999997,0.86099999999999999,0.88200000000000001,0.90300000000000002,0.92500000000000004,0.94699999999999995,0.97,0.99299999999999999]
[null,9,0.80400000000000005,0.82299999999999995,0.84299999999999997,0.86299999999999999,0.88400000000000001,0.90500000000000003,0.92700000000000005,0.94899999999999995,0.97199999999999998,0.995]
[null,10,0.80500000000000005,0.82499999999999996,0.84499999999999997,0.86499999999999999,0.88600000000000001,0.90700000000000003,0.92900000000000005,0.95099999999999996,0.97399999999999998,0.997]
[null,11,0.80700000000000005,0.82599999999999996,0.84599999999999997,0.86699999999999999,0.88700000000000001,0.90900000000000003,0.93,0.95299999999999996,0.97599999999999998,0.999]
[]
[null,"tabARRPenP","P1ER65PEN1"]
[null,"Actuarially reduced pension - premium (NPA 65)"]
[null,null,50,51,52,53,54,55,56,57,58,59,60,61,62,63,64,65]
[null,0,0.504,0.52300000000000002,0.54300000000000004,0.56399999999999995,0.58799999999999997,0.61299999999999999,0.64,0.67,0.70099999999999996,0.73499999999999999,0.77100000000000002,0.81,0.85199999999999998,0.89800000000000002,0.94799999999999995,1]
[null,1,0.50600000000000001,0.52400000000000002,0.54500000000000004,0.56599999999999995,0.59,0.61499999999999999,0.64300000000000002,0.67200000000000004,0.70399999999999996,0.73799999999999999,0.77400000000000002,0.81399999999999995,0.85599999999999998,0.90200000000000002,0.95299999999999996]
[null,2,0.50700000000000001,0.52600000000000002,0.54600000000000004,0.56799999999999995,0.59199999999999997,0.61799999999999999,0.64500000000000002,0.67500000000000004,0.70699999999999996,0.74099999999999999,0.77700000000000002,0.81699999999999995,0.86,0.90600000000000003,0.95699999999999996]
[null,3,0.50900000000000001,0.52800000000000002,0.54800000000000004,0.56999999999999995,0.59399999999999997,0.62,0.64800000000000002,0.67700000000000005,0.70899999999999996,0.74399999999999999,0.78100000000000003,0.82099999999999995,0.86399999999999999,0.91100000000000003,0.96199999999999997]
[null,4,0.51,0.52900000000000003,0.55000000000000004,0.57199999999999995,0.59599999999999997,0.622,0.65,0.68,0.71199999999999997,0.747,0.78400000000000003,0.82399999999999995,0.86799999999999999,0.91500000000000004,0.96599999999999997]
[null,5,0.51200000000000001,0.53100000000000003,0.55200000000000005,0.57399999999999995,0.59799999999999998,0.624,0.65300000000000002,0.68300000000000005,0.71499999999999997,0.75,0.78700000000000003,0.82799999999999996,0.871,0.91900000000000004,0.97099999999999997]
[null,6,0.51300000000000001,0.53300000000000003,0.55400000000000005,0.57599999999999996,0.6,0.627,0.65500000000000003,0.68500000000000005,0.71799999999999997,0.753,0.79,0.83099999999999996,0.875,0.92300000000000004,0.97499999999999998]
[null,7,0.51500000000000001,0.53400000000000003,0.55500000000000005,0.57799999999999996,0.60299999999999998,0.629,0.65700000000000003,0.68799999999999994,0.72099999999999997,0.75600000000000001,0.79400000000000004,0.83499999999999996,0.879,0.92700000000000005,0.98]
[null,8,0.51700000000000002,0.53600000000000003,0.55700000000000005,0.57999999999999996,0.60499999999999998,0.63100000000000001,0.66,0.69,0.72299999999999998,0.75900000000000001,0.79700000000000004,0.83799999999999997,0.88300000000000001,0.93100000000000005,0.98399999999999999]
[null,9,0.51800000000000002,0.53800000000000003,0.55900000000000005,0.58199999999999996,0.60699999999999998,0.63400000000000001,0.66200000000000003,0.69299999999999995,0.72599999999999998,0.76200000000000001,0.8,0.84199999999999997,0.88700000000000001,0.93500000000000005,0.98899999999999999]
[null,10,0.52,0.53900000000000003,0.56100000000000005,0.58399999999999996,0.60899999999999999,0.63600000000000001,0.66500000000000004,0.69599999999999995,0.72899999999999998,0.76500000000000001,0.80300000000000005,0.84499999999999997,0.89,0.94,0.99299999999999999]
[null,11,0.52100000000000002,0.54100000000000004,0.56299999999999994,0.58599999999999997,0.61099999999999999,0.63800000000000001,0.66700000000000004,0.69799999999999995,0.73199999999999998,0.76800000000000002,0.80700000000000005,0.84899999999999998,0.89400000000000002,0.94399999999999995,0.998]
[]
[]
[null,"Buyout Factors"]
[]
[null,"tabARRBuyout_PA60"]
[null,"Table 1: Factors for actuarial reduction buyout : Normal Pension Age 60"]
[null,null,50,51,52,53,54,55,56,57,58,59]
[null,0,8.31,7.65,6.94,6.21,5.43,4.5999999999999996,3.74,2.85,1.93,0.98]
[null,1,8.26,7.59,6.88,6.15,5.36,4.53,3.67,2.77,1.85,0.9]
[null,2,8.1999999999999993,7.53,6.82,6.08,5.29,4.46,3.59,2.7,1.77,0.82]
[null,3,8.15,7.47,6.76,6.02,5.22,4.3899999999999997,3.52,2.62,1.69,0.74]
[null,4,8.09,7.41,6.7,5.95,5.15,4.3099999999999996,3.44,2.54,1.61,0.65]
[null,5,8.0399999999999991,7.35,6.64,5.89,5.08,4.24,3.37,2.4700000000000002,1.53,0.56999999999999995]
[null,6,7.98,7.3,6.58,5.82,5.0199999999999996,4.17,3.3,2.39,1.46,0.49]
[null,7,7.93,7.24,6.51,5.76,4.95,4.0999999999999996,3.22,2.31,1.38,0.41]
[null,8,7.87,7.18,6.45,5.69,4.88,4.03,3.15,2.2400000000000002,1.3,0.33]
[null,9,7.82,7.12,6.39,5.63,4.8099999999999996,3.96,3.07,2.16,1.22,0.25]
[null,10,7.76,7.06,6.33,5.56,4.74,3.88,3,2.08,1.1399999999999999,0.16]
[null,11,7.71,7,6.27,5.5,4.67,3.81,2.92,2.0099999999999998,1.06,0.08]
[]
[null,"tabARRBuyout_nuvos"]
[null,"Table 2: Factors for actuarial reduction buyout : nuvos "]
[null,null,55,56,57,58,59,60,61,62,63,64]
[null,0,8.32,7.56,6.83,6.11,5.41,4.7300000000000004,3.71,2.72,1.77,0.86]
[null,1,8.25,7.5,6.77,6.06,5.35,4.6500000000000004,3.63,2.64,1.69,0.79]
[null,2,8.19,7.44,6.71,6,5.3,4.5599999999999996,3.55,2.56,1.62,0.72]
[null,3,8.1300000000000008,7.38,6.65,5.94,5.24,4.4800000000000004,3.47,2.48,1.54,0.65]
[null,4,8.07,7.32,6.59,5.88,5.19,4.3899999999999997,3.38,2.4,1.47,0.56999999999999995]
[null,5,8,7.26,6.53,5.82,5.13,4.3099999999999996,3.3,2.33,1.39,0.5]
[null,6,7.94,7.2,6.47,5.76,5.07,4.22,3.22,2.25,1.32,0.43]
[null,7,7.88,7.14,6.41,5.7,5.0199999999999996,4.1399999999999997,3.14,2.17,1.24,0.36]
[null,8,7.82,7.08,6.35,5.65,4.96,4.05,3.05,2.09,1.1599999999999999,0.28999999999999998]
[null,9,7.75,7.02,6.29,5.59,4.9000000000000004,3.97,2.97,2.0099999999999998,1.0900000000000001,0.22]
[null,10,7.69,6.95,6.23,5.53,4.8499999999999996,3.88,2.89,1.93,1.01,0.14000000000000001]
[null,11,7.63,6.89,6.17,5.47,4.79,3.8,2.8,1.85,0.94,7.0000000000000007E-2]
[]
[null,"tabARRBuyoutP_PA65"]
[null,"Table 3: Factors for actuarial reduction buyout : Premium members with Normal Pension Age 65"]
[null,null,55,56,57,58,59,60,61,62,63,64]
[null,0,8.49,7.76,7.01,6.23,5.42,4.59,3.74,2.85,1.93,0.98]
[null,1,8.43,7.7,6.95,6.16,5.35,4.5199999999999996,3.67,2.77,1.85,0.9]
[null,2,8.3699999999999992,7.64,6.88,6.1,5.28,4.45,3.59,2.7,1.77,0.82]
[null,3,8.31,7.57,6.82,6.03,5.21,4.38,3.52,2.62,1.69,0.74]
[null,4,8.25,7.51,6.75,5.96,5.14,4.3099999999999996,3.44,2.54,1.61,0.65]
[null,5,8.19,7.45,6.69,5.89,5.07,4.24,3.37,2.4700000000000002,1.53,0.56999999999999995]
[null,6,8.1300000000000008,7.39,6.62,5.83,5.01,4.17,3.3,2.39,1.46,0.49]
[null,7,8.06,7.32,6.56,5.76,4.9400000000000004,4.09,3.22,2.31,1.38,0.41]
[null,8,8,7.26,6.49,5.69,4.87,4.0199999999999996,3.15,2.2400000000000002,1.3,0.33]
[null,9,7.94,7.2,6.43,5.62,4.8,3.95,3.07,2.16,1.22,0.25]
[null,10,7.88,7.14,6.36,5.56,4.7300000000000004,3.88,3,2.08,1.1399999999999999,0.16]
[null,11,7.82,7.07,6.3,5.49,4.66,3.81,2.92,2.0099999999999998,1.06,0.08]

{"sheet":"AlphaERF_hide","index":3,"n_rows":2028,"n_cols":15,"rows_kept":2028,"cut":false,"hidden":true,"merged":[[4,2,4,6],[0,2,0,11],[3,2,3,10]]}
[null,null,{"$f":"strToolName&\" - Alpha Table Data\"","v":"Early Retirement Estimator for classic, classic plus and premium - Alpha Table Data"}]
[]
[]
[null,"Description","This sheet is intended to be used by ADMINISTRATION staff as a backend tool.  It is not expected that this will be exposed to the public users."]
[null,"Schemes","alpha"]
[]
[]
[]
[]
[null,"tabAlphaERF",null,null,null,null,null,null,null,"tabAlphaBuyout"]
[null,"Alpha ERF",null,null,null,null,null,null,null,"Alpha Buyout"]
[null,"ID","Value","Sex","NPA","AgeYear","AgeMonths",null,null,"ID","Value","Sex","NPA","AgeYear","AgeMonths"]
[null,{"$f":"E13&\"_\"&F13&\"Y\"&G13&\"M\"","v":"65_54Y0M"},0.57999999999999996,"M",65,54,0,null,null,{"$f":"M13&\"_\"&N13&\"Y\"&O13&\"M\"","v":"65_54Y0M"},10,"M",65,54,0]
[null,{"$f":"E14&\"_\"&F14&\"Y\"&G14&\"M\"","v":"65_54Y1M"},0.58199999999999996,"M",65,54,1,null,null,{"$f":"M14&\"_\"&N14&\"Y\"&O14&\"M\"","v":"65_54Y1M"},10,"M",65,54,1]
[null,"65_54Y2M",0.58499999999999996,"M",65,54,2,null,null,"65_54Y2M",10,"M",65,54,2]
[null,"65_54Y3M",0.58699999999999997,"M",65,54,3,null,null,"65_54Y3M",10,"M",65,54,3]
[null,"65_54Y4M",0.58899999999999997,"M",65,54,4,null,null,"65_54Y4M",10,"M",65,54,4]
[null,"65_54Y5M",0.59099999999999997,"M",65,54,5,null,null,"65_54Y5M",10,"M",65,54,5]
[null,"65_54Y6M",0.59399999999999997,"M",65,54,6,null,null,"65_54Y6M",10,"M",65,54,6]
[null,"65_54Y7M",0.59599999999999997,"M",65,54,7,null,null,"65_54Y7M",10,"M",65,54,7]
[null,"65_54Y8M",0.59799999999999998,"M",65,54,8,null,null,"65_54Y8M",10,"M",65,54,8]
[null,"65_54Y9M",0.6,"M",65,54,9,null,null,"65_54Y9M",10,"M",65,54,9]
[null,"65_54Y10M",0.60199999999999998,"M",65,54,10,null,null,"65_54Y10M",10,"M",65,54,10]
[null,"65_54Y11M",0.60499999999999998,"M",65,54,11,null,null,"65_54Y11M",10,"M",65,54,11]
[null,"65_55Y0M",0.60699999999999998,"M",65,55,0,null,null,"65_55Y0M",10,"M",65,55,0]
[null,"65_55Y1M",0.60899999999999999,"M",65,55,1,null,null,"65_55Y1M",10,"M",65,55,1]
[null,"65_55Y2M",0.61199999999999999,"M",65,55,2,null,null,"65_55Y2M",10,"M",65,55,2]
[null,"65_55Y3M",0.61399999999999999,"M",65,55,3,null,null,"65_55Y3M",10,"M",65,55,3]
[null,"65_55Y4M",0.61599999999999999,"M",65,55,4,null,null,"65_55Y4M",10,"M",65,55,4]
[null,"65_55Y5M",0.61899999999999999,"M",65,55,5,null,null,"65_55Y5M",10,"M",65,55,5]
[null,"65_55Y6M",0.621,"M",65,55,6,null,null,"65_55Y6M",10,"M",65,55,6]
[null,"65_55Y7M",0.623,"M",65,55,7,null,null,"65_55Y7M",10,"M",65,55,7]
[null,"65_55Y8M",0.626,"M",65,55,8,null,null,"65_55Y8M",10,"M",65,55,8]
[null,"65_55Y9M",0.628,"M",65,55,9,null,null,"65_55Y9M",10,"M",65,55,9]
[null,"65_55Y10M",0.63,"M",65,55,10,null,null,"65_55Y10M",10,"M",65,55,10]
[null,"65_55Y11M",0.63300000000000001,"M",65,55,11,null,null,"65_55Y11M",10,"M",65,55,11]
[null,"65_56Y0M",0.63500000000000001,"M",65,56,0,null,null,"65_56Y0M",10,"M",65,56,0]
[null,"65_56Y1M",0.63800000000000001,"M",65,56,1,null,null,"65_56Y1M",10,"M",65,56,1]
[null,"65_56Y2M",0.64,"M",65,56,2,null,null,"65_56Y2M",10,"M",65,56,2]
[null,"65_56Y3M",0.64300000000000002,"M",65,56,3,null,null,"65_56Y3M",10,"M",65,56,3]
[null,"65_56Y4M",0.64500000000000002,"M",65,56,4,null,null,"65_56Y4M",10,"M",65,56,4]
[null,"65_56Y5M",0.64800000000000002,"M",65,56,5,null,null,"65_56Y5M",10,"M",65,56,5]
[null,"65_56Y6M",0.65,"M",65,56,6,null,null,"65_56Y6M",10,"M",65,56,6]
[null,"65_56Y7M",0.65300000000000002,"M",65,56,7,null,null,"65_56Y7M",10,"M",65,56,7]
[null,"65_56Y8M",0.65500000000000003,"M",65,56,8,null,null,"65_56Y8M",10,"M",65,56,8]
[null,"65_56Y9M",0.65800000000000003,"M",65,56,9,null,null,"65_56Y9M",10,"M",65,56,9]
[null,"65_56Y10M",0.66,"M",65,56,10,null,null,"65_56Y10M",10,"M",65,56,10]
[null,"65_56Y11M",0.66300000000000003,"M",65,56,11,null,null,"65_56Y11M",10,"M",65,56,11]
[null,"65_57Y0M",0.66500000000000004,"M",65,57,0,null,null,"65_57Y0M",10,"M",65,57,0]
[null,"65_57Y1M",0.66800000000000004,"M",65,57,1,null,null,"65_57Y1M",10,"M",65,57,1]
[null,"65_57Y2M",0.67100000000000004,"M",65,57,2,null,null,"65_57Y2M",10,"M",65,57,2]
[null,"65_57Y3M",0.67300000000000004,"M",65,57,3,null,null,"65_57Y3M",10,"M",65,57,3]
[null,"65_57Y4M",0.67600000000000005,"M",65,57,4,null,null,"65_57Y4M",10,"M",65,57,4]
[null,"65_57Y5M",0.67900000000000005,"M",65,57,5,null,null,"65_57Y5M",10,"M",65,57,5]
[null,"65_57Y6M",0.68100000000000005,"M",65,57,6,null,null,"65_57Y6M",10,"M",65,57,6]
[null,"65_57Y7M",0.68400000000000005,"M",65,57,7,null,null,"65_57Y7M",10,"M",65,57,7]
[null,"65_57Y8M",0.68700000000000006,"M",65,57,8,null,null,"65_57Y8M",10,"M",65,57,8]
[null,"65_57Y9M",0.68899999999999995,"M",65,57,9,null,null,"65_57Y9M",10,"M",65,57,9]
[null,"65_57Y10M",0.69199999999999995,"M",65,57,10,null,null,"65_57Y10M",10,"M",65,57,10]
[null,"65_57Y11M",0.69499999999999995,"M",65,57,11,null,null,"65_57Y11M",10,"M",65,57,11]
[null,"65_58Y0M",0.69699999999999995,"M",65,58,0,null,null,"65_58Y0M",10,"M",65,58,0]
[null,"65_58Y1M",0.7,"M",65,58,1,null,null,"65_58Y1M",10,"M",65,58,1]
[null,"65_58Y2M",0.70299999999999996,"M",65,58,2,null,null,"65_58Y2M",10,"M",65,58,2]
[null,"65_58Y3M",0.70599999999999996,"M",65,58,3,null,null,"65_58Y3M",10,"M",65,58,3]
[null,"65_58Y4M",0.70899999999999996,"M",65,58,4,null,null,"65_58Y4M",10,"M",65,58,4]
[null,"65_58Y5M",0.71199999999999997,"M",65,58,5,null,null,"65_58Y5M",10,"M",65,58,5]
[null,"65_58Y6M",0.71499999999999997,"M",65,58,6,null,null,"65_58Y6M",10,"M",65,58,6]
[null,"65_58Y7M",0.71799999999999997,"M",65,58,7,null,null,"65_58Y7M",10,"M",65,58,7]
[null,"65_58Y8M",0.72,"M",65,58,8,null,null,"65_58Y8M",10,"M",65,58,8]
[null,"65_58Y9M",0.72299999999999998,"M",65,58,9,null,null,"65_58Y9M",10,"M",65,58,9]
[null,"65_58Y10M",0.72599999999999998,"M",65,58,10,null,null,"65_58Y10M",10,"M",65,58,10]
[null,"65_58Y11M",0.72899999999999998,"M",65,58,11,null,null,"65_58Y11M",10,"M",65,58,11]
[null,"65_59Y0M",0.73199999999999998,"M",65,59,0,null,null,"65_59Y0M",10,"M",65,59,0]
[null,"65_59Y1M",0.73499999999999999,"M",65,59,1,null,null,"65_59Y1M",10,"M",65,59,1]
[null,"65_59Y2M",0.73799999999999999,"M",65,59,2,null,null,"65_59Y2M",10,"M",65,59,2]
[null,"65_59Y3M",0.74099999999999999,"M",65,59,3,null,null,"65_59Y3M",10,"M",65,59,3]
[null,"65_59Y4M",0.74399999999999999,"M",65,59,4,null,null,"65_59Y4M",10,"M",65,59,4]
[null,{"$f":"E78&\"_\"&F78&\"Y\"&G78&\"M\"","v":"65_59Y5M"},0.747,"M",65,59,5,null,null,{"$f":"M78&\"_\"&N78&\"Y\"&O78&\"M\"","v":"65_59Y5M"},10,"M",65,59,5]
[null,"65_59Y6M",0.75,"M",65,59,6,null,null,"65_59Y6M",10,"M",65,59,6]
[null,"65_59Y7M",0.754,"M",65,59,7,null,null,"65_59Y7M",10,"M",65,59,7]
[null,"65_59Y8M",0.75700000000000001,"M",65,59,8,null,null,"65_59Y8M",10,"M",65,59,8]
[null,"65_59Y9M",0.76,"M",65,59,9,null,null,"65_59Y9M",10,"M",65,59,9]
[null,"65_59Y10M",0.76300000000000001,"M",65,59,10,null,null,"65_59Y10M",10,"M",65,59,10]
[null,"65_59Y11M",0.76600000000000001,"M",65,59,11,null,null,"65_59Y11M",10,"M",65,59,11]
[null,"65_60Y0M",0.76900000000000002,"M",65,60,0,null,null,"65_60Y0M",10,"M",65,60,0]
[null,"65_60Y1M",0.77200000000000002,"M",65,60,1,null,null,"65_60Y1M",10,"M",65,60,1]
[null,"65_60Y2M",0.77600000000000002,"M",65,60,2,null,null,"65_60Y2M",10,"M",65,60,2]
[null,"65_60Y3M",0.77900000000000003,"M",65,60,3,null,null,"65_60Y3M",10,"M",65,60,3]
[null,"65_60Y4M",0.78200000000000003,"M",65,60,4,null,null,"65_60Y4M",10,"M",65,60,4]
[null,"65_60Y5M",0.78600000000000003,"M",65,60,5,null,null,"65_60Y5M",10,"M",65,60,5]
[null,"65_60Y6M",0.78900000000000003,"M",65,60,6,null,null,"65_60Y6M",10,"M",65,60,6]
[null,"65_60Y7M",0.79200000000000004,"M",65,60,7,null,null,"65_60Y7M",10,"M",65,60,7]
[null,"65_60Y8M",0.79600000000000004,"M",65,60,8,null,null,"65_60Y8M",10,"M",65,60,8]
[null,"65_60Y9M",0.79900000000000004,"M",65,60,9,null,null,"65_60Y9M",10,"M",65,60,9]
[null,"65_60Y10M",0.80200000000000005,"M",65,60,10,null,null,"65_60Y10M",10,"M",65,60,10]
[null,"65_60Y11M",0.80500000000000005,"M",65,60,11,null,null,"65_60Y11M",10,"M",65,60,11]
[null,"65_61Y0M",0.80900000000000005,"M",65,61,0,null,null,"65_61Y0M",10,"M",65,61,0]
[null,"65_61Y1M",0.81200000000000006,"M",65,61,1,null,null,"65_61Y1M",10,"M",65,61,1]
[null,"65_61Y2M",0.81599999999999995,"M",65,61,2,null,null,"65_61Y2M",10,"M",65,61,2]
[null,"65_61Y3M",0.82,"M",65,61,3,null,null,"65_61Y3M",10,"M",65,61,3]
[null,"65_61Y4M",0.82299999999999995,"M",65,61,4,null,null,"65_61Y4M",10,"M",65,61,4]
[null,"65_61Y5M",0.82699999999999996,"M",65,61,5,null,null,"65_61Y5M",10,"M",65,61,5]
[null,"65_61Y6M",0.83,"M",65,61,6,null,null,"65_61Y6M",10,"M",65,61,6]
[null,"65_61Y7M",0.83399999999999996,"M",65,61,7,null,null,"65_61Y7M",10,"M",65,61,7]
[null,"65_61Y8M",0.83699999999999997,"M",65,61,8,null,null,"65_61Y8M",10,"M",65,61,8]
[null,"65_61Y9M",0.84099999999999997,"M",65,61,9,null,null,"65_61Y9M",10,"M",65,61,9]
[null,"65_61Y10M",0.84499999999999997,"M",65,61,10,null,null,"65_61Y10M",10,"M",65,61,10]
[null,"65_61Y11M",0.84799999999999998,"M",65,61,11,null,null,"65_61Y11M",10,"M",65,61,11]
[null,"65_62Y0M",0.85199999999999998,"M",65,62,0,null,null,"65_62Y0M",10,"M",65,62,0]
[null,"65_62Y1M",0.85599999999999998,"M",65,62,1,null,null,"65_62Y1M",10,"M",65,62,1]
[null,"65_62Y2M",0.85899999999999999,"M",65,62,2,null,null,"65_62Y2M",10,"M",65,62,2]
[null,"65_62Y3M",0.86299999999999999,"M",65,62,3,null,null,"65_62Y3M",10,"M",65,62,3]
[null,"65_62Y4M",0.86699999999999999,"M",65,62,4,null,null,"65_62Y4M",10,"M",65,62,4]
[null,"65_62Y5M",0.871,"M",65,62,5,null,null,"65_62Y5M",10,"M",65,62,5]
[null,"65_62Y6M",0.875,"M",65,62,6,null,null,"65_62Y6M",10,"M",65,62,6]
[null,"65_62Y7M",0.879,"M",65,62,7,null,null,"65_62Y7M",10,"M",65,62,7]
[null,"65_62Y8M",0.88300000000000001,"M",65,62,8,null,null,"65_62Y8M",10,"M",65,62,8]
[null,"65_62Y9M",0.88600000000000001,"M",65,62,9,null,null,"65_62Y9M",10,"M",65,62,9]
[null,"65_62Y10M",0.89,"M",65,62,10,null,null,"65_62Y10M",10,"M",65,62,10]
[null,"65_62Y11M",0.89400000000000002,"M",65,62,11,null,null,"65_62Y11M",10,"M",65,62,11]
[null,"65_63Y0M",0.89800000000000002,"M",65,63,0,null,null,"65_63Y0M",10,"M",65,63,0]
[null,"65_63Y1M",0.90200000000000002,"M",65,63,1,null,null,"65_63Y1M",10,"M",65,63,1]
[null,"65_63Y2M",0.90600000000000003,"M",65,63,2,null,null,"65_63Y2M",10,"M",65,63,2]
[null,"65_63Y3M",0.91100000000000003,"M",65,63,3,null,null,"65_63Y3M",10,"M",65,63,3]
[null,"65_63Y4M",0.91500000000000004,"M",65,63,4,null,null,"65_63Y4M",10,"M",65,63,4]
[null,"65_63Y5M",0.91900000000000004,"M",65,63,5,null,null,"65_63Y5M",10,"M",65,63,5]
[null,"65_63Y6M",0.92300000000000004,"M",65,63,6,null,null,"65_63Y6M",10,"M",65,63,6]
[null,"65_63Y7M",0.92700000000000005,"M",65,63,7,null,null,"65_63Y7M",10,"M",65,63,7]
[null,"65_63Y8M",0.93100000000000005,"M",65,63,8,null,null,"65_63Y8M",10,"M",65,63,8]
[null,"65_63Y9M",0.93600000000000005,"M",65,63,9,null,null,"65_63Y9M",10,"M",65,63,9]
[null,"65_63Y10M",0.94,"M",65,63,10,null,null,"65_63Y10M",10,"M",65,63,10]
[null,"65_63Y11M",0.94399999999999995,"M",65,63,11,null,null,"65_63Y11M",10,"M",65,63,11]
[null,"65_64Y0M",0.94799999999999995,"M",65,64,0,null,null,"65_64Y0M",10,"M",65,64,0]
[null,"65_64Y1M",0.95299999999999996,"M",65,64,1,null,null,"65_64Y1M",10,"M",65,64,1]
[null,"65_64Y2M",0.95699999999999996,"M",65,64,2,null,null,"65_64Y2M",10,"M",65,64,2]
[null,"65_64Y3M",0.96199999999999997,"M",65,64,3,null,null,"65_64Y3M",10,"M",65,64,3]
[null,"65_64Y4M",0.96599999999999997,"M",65,64,4,null,null,"65_64Y4M",10,"M",65,64,4]
[null,"65_64Y5M",0.97099999999999997,"M",65,64,5,null,null,"65_64Y5M",10,"M",65,64,5]
[null,"65_64Y6M",0.97499999999999998,"M",65,64,6,null,null,"65_64Y6M",10,"M",65,64,6]
[null,"65_64Y7M",0.98,"M",65,64,7,null,null,"65_64Y7M",10,"M",65,64,7]
[null,"65_64Y8M",0.98399999999999999,"M",65,64,8,null,null,"65_64Y8M",10,"M",65,64,8]
[null,{"$f":"E142&\"_\"&F142&\"Y\"&G142&\"M\"","v":"65_64Y9M"},0.98899999999999999,"M",65,64,9,null,null,{"$f":"M142&\"_\"&N142&\"Y\"&O142&\"M\"","v":"65_64Y9M"},10,"M",65,64,9]
[null,"65_64Y10M",0.99299999999999999,"M",65,64,10,null,null,"65_64Y10M",10,"M",65,64,10]
[null,"65_64Y11M",0.995,"M",65,64,11,null,null,"65_64Y11M",10,"M",65,64,11]
[null,"65_65Y0M",1,"M",65,65,0,null,null,"65_65Y0M",10,"M",65,65,0]
[null,"65_65Y1M",1,"M",65,65,1,null,null,"65_65Y1M",10,"M",65,65,1]
[null,"65_65Y2M",1,"M",65,65,2,null,null,"65_65Y2M",10,"M",65,65,2]
[null,"65_65Y3M",1,"M",65,65,3,null,null,"65_65Y3M",10,"M",65,65,3]
[null,"65_65Y4M",1,"M",65,65,4,null,null,"65_65Y4M",10,"M",65,65,4]
[null,"65_65Y5M",1,"M",65,65,5,null,null,"65_65Y5M",10,"M",65,65,5]
[null,"65_65Y6M",1,"M",65,65,6,null,null,"65_65Y6M",10,"M",65,65,6]
[null,"65_65Y7M",1,"M",65,65,7,null,null,"65_65Y7M",10,"M",65,65,7]
[null,"65_65Y8M",1,"M",65,65,8,null,null,"65_65Y8M",10,"M",65,65,8]
[null,"65_65Y9M",1,"M",65,65,9,null,null,"65_65Y9M",10,"M",65,65,9]
[null,"65_65Y10M",1,"M",65,65,10,null,null,"65_65Y10M",10,"M",65,65,10]
[null,"65_65Y11M",1,"M",65,65,11,null,null,"65_65Y11M",10,"M",65,65,11]
[null,"65_66Y0M",1,"M",65,66,0,null,null,"65_66Y0M",10,"M",65,66,0]
[null,"65_66Y1M",1,"M",65,66,1,null,null,"65_66Y1M",10,"M",65,66,1]
[null,"65_66Y2M",1,"M",65,66,2,null,null,"65_66Y2M",10,"M",65,66,2]
[null,"65_66Y3M",1,"M",65,66,3,null,null,"65_66Y3M",10,"M",65,66,3]
[null,"65_66Y4M",1,"M",65,66,4,null,null,"65_66Y4M",10,"M",65,66,4]
[null,"65_66Y5M",1,"M",65,66,5,null,null,"65_66Y5M",10,"M",65,66,5]
[null,"65_66Y6M",1,"M",65,66,6,null,null,"65_66Y6M",10,"M",65,66,6]
[null,"65_66Y7M",1,"M",65,66,7,null,null,"65_66Y7M",10,"M",65,66,7]
[null,"65_66Y8M",1,"M",65,66,8,null,null,"65_66Y8M",10,"M",65,66,8]
[null,"65_66Y9M",1,"M",65,66,9,null,null,"65_66Y9M",10,"M",65,66,9]
[null,"65_66Y10M",1,"M",65,66,10,null,null,"65_66Y10M",10,"M",65,66,10]
[null,"65_66Y11M",1,"M",65,66,11,null,null,"65_66Y11M",10,"M",65,66,11]
[null,"65_67Y0M",1,"M",65,67,0,null,null,"65_67Y0M",10,"M",65,67,0]
[null,"65_67Y1M",1,"M",65,67,1,null,null,"65_67Y1M",10,"M",65,67,1]
[null,"65_67Y2M",1,"M",65,67,2,null,null,"65_67Y2M",10,"M",65,67,2]
[null,"65_67Y3M",1,"M",65,67,3,null,null,"65_67Y3M",10,"M",65,67,3]
[null,"65_67Y4M",1,"M",65,67,4,null,null,"65_67Y4M",10,"M",65,67,4]
[null,"65_67Y5M",1,"M",65,67,5,null,null,"65_67Y5M",10,"M",65,67,5]
[null,"65_67Y6M",1,"M",65,67,6,null,null,"65_67Y6M",10,"M",65,67,6]
[null,"65_67Y7M",1,"M",65,67,7,null,null,"65_67Y7M",10,"M",65,67,7]
[null,"65_67Y8M",1,"M",65,67,8,null,null,"65_67Y8M",10,"M",65,67,8]
[null,"65_67Y9M",1,"M",65,67,9,null,null,"65_67Y9M",10,"M",65,67,9]
[null,"65_67Y10M",1,"M",65,67,10,null,null,"65_67Y10M",10,"M",65,67,10]
[null,"65_67Y11M",1,"M",65,67,11,null,null,"65_67Y11M",10,"M",65,67,11]
[null,"65_68Y0M",1,"M",65,68,0,null,null,"65_68Y0M",10,"M",65,68,0]
[null,"65_68Y1M",1,"M",65,68,1,null,null,"65_68Y1M",10,"M",65,68,1]
[null,"65_68Y2M",1,"M",65,68,2,null,null,"65_68Y2M",10,"M",65,68,2]
[null,"65_68Y3M",1,"M",65,68,3,null,null,"65_68Y3M",10,"M",65,68,3]
[null,"65_68Y4M",1,"M",65,68,4,null,null,"65_68Y4M",10,"M",65,68,4]
[null,"65_68Y5M",1,"M",65,68,5,null,null,"65_68Y5M",10,"M",65,68,5]
[null,"65_68Y6M",1,"M",65,68,6,null,null,"65_68Y6M",10,"M",65,68,6]
[null,"65_68Y7M",1,"M",65,68,7,null,null,"65_68Y7M",10,"M",65,68,7]
[null,"65_68Y8M",1,"M",65,68,8,null,null,"65_68Y8M",10,"M",65,68,8]
[null,"65_68Y9M",1,"M",65,68,9,null,null,"65_68Y9M",10,"M",65,68,9]
[null,"65_68Y10M",1,"M",65,68,10,null,null,"65_68Y10M",10,"M",65,68,10]
[null,"65_68Y11M",1,"M",65,68,11,null,null,"65_68Y11M",10,"M",65,68,11]
[null,"65_69Y0M",1,"M",65,69,0,null,null,"65_69Y0M",10,"M",65,69,0]
[null,"65_69Y1M",1,"M",65,69,1,null,null,"65_69Y1M",10,"M",65,69,1]
[null,"65_69Y2M",1,"M",65,69,2,null,null,"65_69Y2M",10,"M",65,69,2]
[null,"65_69Y3M",1,"M",65,69,3,null,null,"65_69Y3M",10,"M",65,69,3]
[null,"65_69Y4M",1,"M",65,69,4,null,null,"65_69Y4M",10,"M",65,69,4]
[null,"65_69Y5M",1,"M",65,69,5,null,null,"65_69Y5M",10,"M",65,69,5]
[null,"65_69Y6M",1,"M",65,69,6,null,null,"65_69Y6M",10,"M",65,69,6]
[null,"65_69Y7M",1,"M",65,69,7,null,null,"65_69Y7M",10,"M",65,69,7]
[null,"65_69Y8M",1,"M",65,69,8,null,null,"65_69Y8M",10,"M",65,69,8]
[null,"65_69Y9M",1,"M",65,69,9,null,null,"65_69Y9M",10,"M",65,69,9]
[null,"65_69Y10M",1,"M",65,69,10,null,null,"65_69Y10M",10,"M",65,69,10]
[null,"65_69Y11M",1,"M",65,69,11,null,null,"65_69Y11M",10,"M",65,69,11]
[null,"65_70Y0M",1,"M",65,70,0,null,null,"65_70Y0M",10,"M",65,70,0]
[null,{"$f":"E206&\"_\"&F206&\"Y\"&G206&\"M\"","v":"65_70Y1M"},1,"M",65,70,1,null,null,{"$f":"M206&\"_\"&N206&\"Y\"&O206&\"M\"","v":"65_70Y1M"},10,"M",65,70,1]
[null,"65_70Y2M",1,"M",65,70,2,null,null,"65_70Y2M",10,"M",65,70,2]
[null,"65_70Y3M",1,"M",65,70,3,null,null,"65_70Y3M",10,"M",65,70,3]
[null,"65_70Y4M",1,"M",65,70,4,null,null,"65_70Y4M",10,"M",65,70,4]
[null,"65_70Y5M",1,"M",65,70,5,null,null,"65_70Y5M",10,"M",65,70,5]
[null,"65_70Y6M",1,"M",65,70,6,null,null,"65_70Y6M",10,"M",65,70,6]
[null,"65_70Y7M",1,"M",65,70,7,null,null,"65_70Y7M",10,"M",65,70,7]
[null,"65_70Y8M",1,"M",65,70,8,null,null,"65_70Y8M",10,"M",65,70,8]
[null,"65_70Y9M",1,"M",65,70,9,null,null,"65_70Y9M",10,"M",65,70,9]
[null,"65_70Y10M",1,"M",65,70,10,null,null,"65_70Y10M",10,"M",65,70,10]
[null,"65_70Y11M",1,"M",65,70,11,null,null,"65_70Y11M",10,"M",65,70,11]
[null,"65_71Y0M",1,"M",65,71,0,null,null,"65_71Y0M",10,"M",65,71,0]
[null,"65_71Y1M",1,"M",65,71,1,null,null,"65_71Y1M",10,"M",65,71,1]
[null,"65_71Y2M",1,"M",65,71,2,null,null,"65_71Y2M",10,"M",65,71,2]
[null,"65_71Y3M",1,"M",65,71,3,null,null,"65_71Y3M",10,"M",65,71,3]
[null,"65_71Y4M",1,"M",65,71,4,null,null,"65_71Y4M",10,"M",65,71,4]
[null,"65_71Y5M",1,"M",65,71,5,null,null,"65_71Y5M",10,"M",65,71,5]
[null,"65_71Y6M",1,"M",65,71,6,null,null,"65_71Y6M",10,"M",65,71,6]
[null,"65_71Y7M",1,"M",65,71,7,null,null,"65_71Y7M",10,"M",65,71,7]
[null,"65_71Y8M",1,"M",65,71,8,null,null,"65_71Y8M",10,"M",65,71,8]
[null,"65_71Y9M",1,"M",65,71,9,null,null,"65_71Y9M",10,"M",65,71,9]
[null,"65_71Y10M",1,"M",65,71,10,null,null,"65_71Y10M",10,"M",65,71,10]
[null,"65_71Y11M",1,"M",65,71,11,null,null,"65_71Y11M",10,"M",65,71,11]
[null,"65_72Y0M",1,"M",65,72,0,null,null,"65_72Y0M",10,"M",65,72,0]
[null,"65_72Y1M",1,"M",65,72,1,null,null,"65_72Y1M",10,"M",65,72,1]
[null,"65_72Y2M",1,"M",65,72,2,null,null,"65_72Y2M",10,"M",65,72,2]
[null,"65_72Y3M",1,"M",65,72,3,null,null,"65_72Y3M",10,"M",65,72,3]
[null,"65_72Y4M",1,"M",65,72,4,null,null,"65_72Y4M",10,"M",65,72,4]
[null,"65_72Y5M",1,"M",65,72,5,null,null,"65_72Y5M",10,"M",65,72,5]
[null,"65_72Y6M",1,"M",65,72,6,null,null,"65_72Y6M",10,"M",65,72,6]
[null,"65_72Y7M",1,"M",65,72,7,null,null,"65_72Y7M",10,"M",65,72,7]
[null,"65_72Y8M",1,"M",65,72,8,null,null,"65_72Y8M",10,"M",65,72,8]
[null,"65_72Y9M",1,"M",65,72,9,null,null,"65_72Y9M",10,"M",65,72,9]
[null,"65_72Y10M",1,"M",65,72,10,null,null,"65_72Y10M",10,"M",65,72,10]
[null,"65_72Y11M",1,"M",65,72,11,null,null,"65_72Y11M",10,"M",65,72,11]
[null,"65_73Y0M",1,"M",65,73,0,null,null,"65_73Y0M",10,"M",65,73,0]
[null,"65_73Y1M",1,"M",65,73,1,null,null,"65_73Y1M",10,"M",65,73,1]
[null,"65_73Y2M",1,"M",65,73,2,null,null,"65_73Y2M",10,"M",65,73,2]
[null,"65_73Y3M",1,"M",65,73,3,null,null,"65_73Y3M",10,"M",65,73,3]
[null,"65_73Y4M",1,"M",65,73,4,null,null,"65_73Y4M",10,"M",65,73,4]
[null,"65_73Y5M",1,"M",65,73,5,null,null,"65_73Y5M",10,"M",65,73,5]
[null,"65_73Y6M",1,"M",65,73,6,null,null,"65_73Y6M",10,"M",65,73,6]
[null,"65_73Y7M",1,"M",65,73,7,null,null,"65_73Y7M",10,"M",65,73,7]
[null,"65_73Y8M",1,"M",65,73,8,null,null,"65_73Y8M",10,"M",65,73,8]
[null,"65_73Y9M",1,"M",65,73,9,null,null,"65_73Y9M",10,"M",65,73,9]
[null,"65_73Y10M",1,"M",65,73,10,null,null,"65_73Y10M",10,"M",65,73,10]
[null,"65_73Y11M",1,"M",65,73,11,null,null,"65_73Y11M",10,"M",65,73,11]
[null,"65_74Y0M",1,"M",65,74,0,null,null,"65_74Y0M",10,"M",65,74,0]
[null,"65_74Y1M",1,"M",65,74,1,null,null,"65_74Y1M",10,"M",65,74,1]
[null,"65_74Y2M",1,"M",65,74,2,null,null,"65_74Y2M",10,"M",65,74,2]
[null,"65_74Y3M",1,"M",65,74,3,null,null,"65_74Y3M",10,"M",65,74,3]
[null,"65_74Y4M",1,"M",65,74,4,null,null,"65_74Y4M",10,"M",65,74,4]
[null,"65_74Y5M",1,"M",65,74,5,null,null,"65_74Y5M",10,"M",65,74,5]
[null,"65_74Y6M",1,"M",65,74,6,null,null,"65_74Y6M",10,"M",65,74,6]
[null,"65_74Y7M",1,"M",65,74,7,null,null,"65_74Y7M",10,"M",65,74,7]
[null,"65_74Y8M",1,"M",65,74,8,null,null,"65_74Y8M",10,"M",65,74,8]
[null,"65_74Y9M",1,"M",65,74,9,null,null,"65_74Y9M",10,"M",65,74,9]
[null,"65_74Y10M",1,"M",65,74,10,null,null,"65_74Y10M",10,"M",65,74,10]
[null,"65_74Y11M",1,"M",65,74,11,null,null,"65_74Y11M",10,"M",65,74,11]
[null,"65_54Y0M",0.57999999999999996,"F",65,54,0,null,null,"65_54Y0M",10,"F",65,54,0]
[null,"65_54Y1M",0.58199999999999996,"F",65,54,1,null,null,"65_54Y1M",10,"F",65,54,1]
[null,"65_54Y2M",0.58499999999999996,"F",65,54,2,null,null,"65_54Y2M",10,"F",65,54,2]
[null,"65_54Y3M",0.58699999999999997,"F",65,54,3,null,null,"65_54Y3M",10,"F",65,54,3]
[null,"65_54Y4M",0.58899999999999997,"F",65,54,4,null,null,"65_54Y4M",10,"F",65,54,4]
[null,{"$f":"E270&\"_\"&F270&\"Y\"&G270&\"M\"","v":"65_54Y5M"},0.59099999999999997,"F",65,54,5,null,null,{"$f":"M270&\"_\"&N270&\"Y\"&O270&\"M\"","v":"65_54Y5M"},10,"F",65,54,5]
[null,"65_54Y6M",0.59399999999999997,"F",65,54,6,null,null,"65_54Y6M",10,"F",65,54,6]
[null,"65_54Y7M",0.59599999999999997,"F",65,54,7,null,null,"65_54Y7M",10,"F",65,54,7]
[null,"65_54Y8M",0.59799999999999998,"F",65,54,8,null,null,"65_54Y8M",10,"F",65,54,8]
[null,"65_54Y9M",0.6,"F",65,54,9,null,null,"65_54Y9M",10,"F",65,54,9]
[null,"65_54Y10M",0.60199999999999998,"F",65,54,10,null,null,"65_54Y10M",10,"F",65,54,10]
[null,"65_54Y11M",0.60499999999999998,"F",65,54,11,null,null,"65_54Y11M",10,"F",65,54,11]
[null,"65_55Y0M",0.60699999999999998,"F",65,55,0,null,null,"65_55Y0M",10,"F",65,55,0]
[null,"65_55Y1M",0.60899999999999999,"F",65,55,1,null,null,"65_55Y1M",10,"F",65,55,1]
[null,"65_55Y2M",0.61199999999999999,"F",65,55,2,null,null,"65_55Y2M",10,"F",65,55,2]
[null,"65_55Y3M",0.61399999999999999,"F",65,55,3,null,null,"65_55Y3M",10,"F",65,55,3]
[null,"65_55Y4M",0.61599999999999999,"F",65,55,4,null,null,"65_55Y4M",10,"F",65,55,4]
[null,"65_55Y5M",0.61899999999999999,"F",65,55,5,null,null,"65_55Y5M",10,"F",65,55,5]
[null,"65_55Y6M",0.621,"F",65,55,6,null,null,"65_55Y6M",10,"F",65,55,6]
[null,"65_55Y7M",0.623,"F",65,55,7,null,null,"65_55Y7M",10,"F",65,55,7]
[null,"65_55Y8M",0.626,"F",65,55,8,null,null,"65_55Y8M",10,"F",65,55,8]
[null,"65_55Y9M",0.628,"F",65,55,9,null,null,"65_55Y9M",10,"F",65,55,9]
[null,"65_55Y10M",0.63,"F",65,55,10,null,null,"65_55Y10M",10,"F",65,55,10]
[null,"65_55Y11M",0.63300000000000001,"F",65,55,11,null,null,"65_55Y11M",10,"F",65,55,11]
[null,"65_56Y0M",0.63500000000000001,"F",65,56,0,null,null,"65_56Y0M",10,"F",65,56,0]
[null,"65_56Y1M",0.63800000000000001,"F",65,56,1,null,null,"65_56Y1M",10,"F",65,56,1]
[null,"65_56Y2M",0.64,"F",65,56,2,null,null,"65_56Y2M",10,"F",65,56,2]
[null,"65_56Y3M",0.64300000000000002,"F",65,56,3,null,null,"65_56Y3M",10,"F",65,56,3]
[null,"65_56Y4M",0.64500000000000002,"F",65,56,4,null,null,"65_56Y4M",10,"F",65,56,4]
[null,"65_56Y5M",0.64800000000000002,"F",65,56,5,null,null,"65_56Y5M",10,"F",65,56,5]
[null,"65_56Y6M",0.65,"F",65,56,6,null,null,"65_56Y6M",10,"F",65,56,6]
[null,"65_56Y7M",0.65300000000000002,"F",65,56,7,null,null,"65_56Y7M",10,"F",65,56,7]
[null,"65_56Y8M",0.65500000000000003,"F",65,56,8,null,null,"65_56Y8M",10,"F",65,56,8]
[null,"65_56Y9M",0.65800000000000003,"F",65,56,9,null,null,"65_56Y9M",10,"F",65,56,9]
[null,"65_56Y10M",0.66,"F",65,56,10,null,null,"65_56Y10M",10,"F",65,56,10]
[null,"65_56Y11M",0.66300000000000003,"F",65,56,11,null,null,"65_56Y11M",10,"F",65,56,11]
[null,"65_57Y0M",0.66500000000000004,"F",65,57,0,null,null,"65_57Y0M",10,"F",65,57,0]
[null,"65_57Y1M",0.66800000000000004,"F",65,57,1,null,null,"65_57Y1M",10,"F",65,57,1]
[null,"65_57Y2M",0.67100000000000004,"F",65,57,2,null,null,"65_57Y2M",10,"F",65,57,2]
[null,"65_57Y3M",0.67300000000000004,"F",65,57,3,null,null,"65_57Y3M",10,"F",65,57,3]
[null,"65_57Y4M",0.67600000000000005,"F",65,57,4,null,null,"65_57Y4M",10,"F",65,57,4]
[null,"65_57Y5M",0.67900000000000005,"F",65,57,5,null,null,"65_57Y5M",10,"F",65,57,5]
[null,"65_57Y6M",0.68100000000000005,"F",65,57,6,null,null,"65_57Y6M",10,"F",65,57,6]
[null,"65_57Y7M",0.68400000000000005,"F",65,57,7,null,null,"65_57Y7M",10,"F",65,57,7]
[null,"65_57Y8M",0.68700000000000006,"F",65,57,8,null,null,"65_57Y8M",10,"F",65,57,8]
[null,"65_57Y9M",0.68899999999999995,"F",65,57,9,null,null,"65_57Y9M",10,"F",65,57,9]
[null,"65_57Y10M",0.69199999999999995,"F",65,57,10,null,null,"65_57Y10M",10,"F",65,57,10]
[null,"65_57Y11M",0.69499999999999995,"F",65,57,11,null,null,"65_57Y11M",10,"F",65,57,11]
[null,"65_58Y0M",0.69699999999999995,"F",65,58,0,null,null,"65_58Y0M",10,"F",65,58,0]
[null,"65_58Y1M",0.7,"F",65,58,1,null,null,"65_58Y1M",10,"F",65,58,1]
[null,"65_58Y2M",0.70299999999999996,"F",65,58,2,null,null,"65_58Y2M",10,"F",65,58,2]
[null,"65_58Y3M",0.70599999999999996,"F",65,58,3,null,null,"65_58Y3M",10,"F",65,58,3]
[null,"65_58Y4M",0.70899999999999996,"F",65,58,4,null,null,"65_58Y4M",10,"F",65,58,4]
[null,"65_58Y5M",0.71199999999999997,"F",65,58,5,null,null,"65_58Y5M",10,"F",65,58,5]
[null,"65_58Y6M",0.71499999999999997,"F",65,58,6,null,null,"65_58Y6M",10,"F",65,58,6]
[null,"65_58Y7M",0.71799999999999997,"F",65,58,7,null,null,"65_58Y7M",10,"F",65,58,7]
[null,"65_58Y8M",0.72,"F",65,58,8,null,null,"65_58Y8M",10,"F",65,58,8]
[null,"65_58Y9M",0.72299999999999998,"F",65,58,9,null,null,"65_58Y9M",10,"F",65,58,9]
[null,"65_58Y10M",0.72599999999999998,"F",65,58,10,null,null,"65_58Y10M",10,"F",65,58,10]
[null,"65_58Y11M",0.72899999999999998,"F",65,58,11,null,null,"65_58Y11M",10,"F",65,58,11]
[null,"65_59Y0M",0.73199999999999998,"F",65,59,0,null,null,"65_59Y0M",10,"F",65,59,0]
[null,"65_59Y1M",0.73499999999999999,"F",65,59,1,null,null,"65_59Y1M",10,"F",65,59,1]
[null,"65_59Y2M",0.73799999999999999,"F",65,59,2,null,null,"65_59Y2M",10,"F",65,59,2]
[null,"65_59Y3M",0.74099999999999999,"F",65,59,3,null,null,"65_59Y3M",10,"F",65,59,3]
[null,"65_59Y4M",0.74399999999999999,"F",65,59,4,null,null,"65_59Y4M",10,"F",65,59,4]
[null,"65_59Y5M",0.747,"F",65,59,5,null,null,"65_59Y5M",10,"F",65,59,5]
[null,"65_59Y6M",0.75,"F",65,59,6,null,null,"65_59Y6M",10,"F",65,59,6]
[null,"65_59Y7M",0.754,"F",65,59,7,null,null,"65_59Y7M",10,"F",65,59,7]
[null,"65_59Y8M",0.75700000000000001,"F",65,59,8,null,null,"65_59Y8M",10,"F",65,59,8]
[null,{"$f":"E334&\"_\"&F334&\"Y\"&G334&\"M\"","v":"65_59Y9M"},0.76,"F",65,59,9,null,null,{"$f":"M334&\"_\"&N334&\"Y\"&O334&\"M\"","v":"65_59Y9M"},10,"F",65,59,9]
[null,"65_59Y10M",0.76300000000000001,"F",65,59,10,null,null,"65_59Y10M",10,"F",65,59,10]
[null,"65_59Y11M",0.76600000000000001,"F",65,59,11,null,null,"65_59Y11M",10,"F",65,59,11]
[null,"65_60Y0M",0.76900000000000002,"F",65,60,0,null,null,"65_60Y0M",10,"F",65,60,0]
[null,"65_60Y1M",0.77200000000000002,"F",65,60,1,null,null,"65_60Y1M",10,"F",65,60,1]
[null,"65_60Y2M",0.77600000000000002,"F",65,60,2,null,null,"65_60Y2M",10,"F",65,60,2]
[null,"65_60Y3M",0.77900000000000003,"F",65,60,3,null,null,"65_60Y3M",10,"F",65,60,3]
[null,"65_60Y4M",0.78200000000000003,"F",65,60,4,null,null,"65_60Y4M",10,"F",65,60,4]
[null,"65_60Y5M",0.78600000000000003,"F",65,60,5,null,null,"65_60Y5M",10,"F",65,60,5]
[null,"65_60Y6M",0.78900000000000003,"F",65,60,6,null,null,"65_60Y6M",10,"F",65,60,6]
[null,"65_60Y7M",0.79200000000000004,"F",65,60,7,null,null,"65_60Y7M",10,"F",65,60,7]
[null,"65_60Y8M",0.79600000000000004,"F",65,60,8,null,null,"65_60Y8M",10,"F",65,60,8]
[null,"65_60Y9M",0.79900000000000004,"F",65,60,9,null,null,"65_60Y9M",10,"F",65,60,9]
[null,"65_60Y10M",0.80200000000000005,"F",65,60,10,null,null,"65_60Y10M",10,"F",65,60,10]
[null,"65_60Y11M",0.80500000000000005,"F",65,60,11,null,null,"65_60Y11M",10,"F",65,60,11]
[null,"65_61Y0M",0.80900000000000005,"F",65,61,0,null,null,"65_61Y0M",10,"F",65,61,0]
[null,"65_61Y1M",0.81200000000000006,"F",65,61,1,null,null,"65_61Y1M",10,"F",65,61,1]
[null,"65_61Y2M",0.81599999999999995,"F",65,61,2,null,null,"65_61Y2M",10,"F",65,61,2]
[null,"65_61Y3M",0.82,"F",65,61,3,null,null,"65_61Y3M",10,"F",65,61,3]
[null,"65_61Y4M",0.82299999999999995,"F",65,61,4,null,null,"65_61Y4M",10,"F",65,61,4]
[null,"65_61Y5M",0.82699999999999996,"F",65,61,5,null,null,"65_61Y5M",10,"F",65,61,5]
[null,"65_61Y6M",0.83,"F",65,61,6,null,null,"65_61Y6M",10,"F",65,61,6]
[null,"65_61Y7M",0.83399999999999996,"F",65,61,7,null,null,"65_61Y7M",10,"F",65,61,7]
[null,"65_61Y8M",0.83699999999999997,"F",65,61,8,null,null,"65_61Y8M",10,"F",65,61,8]
[null,"65_61Y9M",0.84099999999999997,"F",65,61,9,null,null,"65_61Y9M",10,"F",65,61,9]
[null,"65_61Y10M",0.84499999999999997,"F",65,61,10,null,null,"65_61Y10M",10,"F",65,61,10]
[null,"65_61Y11M",0.84799999999999998,"F",65,61,11,null,null,"65_61Y11M",10,"F",65,61,11]
[null,"65_62Y0M",0.85199999999999998,"F",65,62,0,null,null,"65_62Y0M",10,"F",65,62,0]
[null,"65_62Y1M",0.85599999999999998,"F",65,62,1,null,null,"65_62Y1M",10,"F",65,62,1]
[null,"65_62Y2M",0.85899999999999999,"F",65,62,2,null,null,"65_62Y2M",10,"F",65,62,2]
[null,"65_62Y3M",0.86299999999999999,"F",65,62,3,null,null,"65_62Y3M",10,"F",65,62,3]
[null,"65_62Y4M",0.86699999999999999,"F",65,62,4,null,null,"65_62Y4M",10,"F",65,62,4]
[null,"65_62Y5M",0.871,"F",65,62,5,null,null,"65_62Y5M",10,"F",65,62,5]
[null,"65_62Y6M",0.875,"F",65,62,6,null,null,"65_62Y6M",10,"F",65,62,6]
[null,"65_62Y7M",0.879,"F",65,62,7,null,null,"65_62Y7M",10,"F",65,62,7]
[null,"65_62Y8M",0.88300000000000001,"F",65,62,8,null,null,"65_62Y8M",10,"F",65,62,8]
[null,"65_62Y9M",0.88600000000000001,"F",65,62,9,null,null,"65_62Y9M",10,"F",65,62,9]
[null,"65_62Y10M",0.89,"F",65,62,10,null,null,"65_62Y10M",10,"F",65,62,10]
[null,"65_62Y11M",0.89400000000000002,"F",65,62,11,null,null,"65_62Y11M",10,"F",65,62,11]
[null,"65_63Y0M",0.89800000000000002,"F",65,63,0,null,null,"65_63Y0M",10,"F",65,63,0]
[null,"65_63Y1M",0.90200000000000002,"F",65,63,1,null,null,"65_63Y1M",10,"F",65,63,1]
[null,"65_63Y2M",0.90600000000000003,"F",65,63,2,null,null,"65_63Y2M",10,"F",65,63,2]
[null,"65_63Y3M",0.91100000000000003,"F",65,63,3,null,null,"65_63Y3M",10,"F",65,63,3]
[null,"65_63Y4M",0.91500000000000004,"F",65,63,4,null,null,"65_63Y4M",10,"F",65,63,4]
[null,"65_63Y5M",0.91900000000000004,"F",65,63,5,null,null,"65_63Y5M",10,"F",65,63,5]
[null,"65_63Y6M",0.92300000000000004,"F",65,63,6,null,null,"65_63Y6M",10,"F",65,63,6]
[null,"65_63Y7M",0.92700000000000005,"F",65,63,7,null,null,"65_63Y7M",10,"F",65,63,7]
[null,"65_63Y8M",0.93100000000000005,"F",65,63,8,null,null,"65_63Y8M",10,"F",65,63,8]
[null,"65_63Y9M",0.93600000000000005,"F",65,63,9,null,null,"65_63Y9M",10,"F",65,63,9]
[null,"65_63Y10M",0.94,"F",65,63,10,null,null,"65_63Y10M",10,"F",65,63,10]
[null,"65_63Y11M",0.94399999999999995,"F",65,63,11,null,null,"65_63Y11M",10,"F",65,63,11]
[null,"65_64Y0M",0.94799999999999995,"F",65,64,0,null,null,"65_64Y0M",10,"F",65,64,0]
[null,"65_64Y1M",0.95299999999999996,"F",65,64,1,null,null,"65_64Y1M",10,"F",65,64,1]
[null,"65_64Y2M",0.95699999999999996,"F",65,64,2,null,null,"65_64Y2M",10,"F",65,64,2]
[null,"65_64Y3M",0.96199999999999997,"F",65,64,3,null,null,"65_64Y3M",10,"F",65,64,3]
[null,"65_64Y4M",0.96599999999999997,"F",65,64,4,null,null,"65_64Y4M",10,"F",65,64,4]
[null,"65_64Y5M",0.97099999999999997,"F",65,64,5,null,null,"65_64Y5M",10,"F",65,64,5]
[null,"65_64Y6M",0.97499999999999998,"F",65,64,6,null,null,"65_64Y6M",10,"F",65,64,6]
[null,"65_64Y7M",0.98,"F",65,64,7,null,null,"65_64Y7M",10,"F",65,64,7]
[null,"65_64Y8M",0.98399999999999999,"F",65,64,8,null,null,"65_64Y8M",10,"F",65,64,8]
[null,"65_64Y9M",0.98899999999999999,"F",65,64,9,null,null,"65_64Y9M",10,"F",65,64,9]
[null,"65_64Y10M",0.99299999999999999,"F",65,64,10,null,null,"65_64Y10M",10,"F",65,64,10]
[null,"65_64Y11M",0.995,"F",65,64,11,null,null,"65_64Y11M",10,"F",65,64,11]
[null,"65_65Y0M",1,"F",65,65,0,null,null,"65_65Y0M",10,"F",65,65,0]
[null,{"$f":"E398&\"_\"&F398&\"Y\"&G398&\"M\"","v":"65_65Y1M"},1,"F",65,65,1,null,null,{"$f":"M398&\"_\"&N398&\"Y\"&O398&\"M\"","v":"65_65Y1M"},10,"F",65,65,1]
[null,"65_65Y2M",1,"F",65,65,2,null,null,"65_65Y2M",10,"F",65,65,2]
[null,"65_65Y3M",1,"F",65,65,3,null,null,"65_65Y3M",10,"F",65,65,3]
[null,"65_65Y4M",1,"F",65,65,4,null,null,"65_65Y4M",10,"F",65,65,4]
[null,"65_65Y5M",1,"F",65,65,5,null,null,"65_65Y5M",10,"F",65,65,5]
[null,"65_65Y6M",1,"F",65,65,6,null,null,"65_65Y6M",10,"F",65,65,6]
[null,"65_65Y7M",1,"F",65,65,7,null,null,"65_65Y7M",10,"F",65,65,7]
[null,"65_65Y8M",1,"F",65,65,8,null,null,"65_65Y8M",10,"F",65,65,8]
[null,"65_65Y9M",1,"F",65,65,9,null,null,"65_65Y9M",10,"F",65,65,9]
[null,"65_65Y10M",1,"F",65,65,10,null,null,"65_65Y10M",10,"F",65,65,10]
[null,"65_65Y11M",1,"F",65,65,11,null,null,"65_65Y11M",10,"F",65,65,11]
[null,"65_66Y0M",1,"F",65,66,0,null,null,"65_66Y0M",10,"F",65,66,0]
[null,"65_66Y1M",1,"F",65,66,1,null,null,"65_66Y1M",10,"F",65,66,1]
[null,"65_66Y2M",1,"F",65,66,2,null,null,"65_66Y2M",10,"F",65,66,2]
[null,"65_66Y3M",1,"F",65,66,3,null,null,"65_66Y3M",10,"F",65,66,3]
[null,"65_66Y4M",1,"F",65,66,4,null,null,"65_66Y4M",10,"F",65,66,4]
[null,"65_66Y5M",1,"F",65,66,5,null,null,"65_66Y5M",10,"F",65,66,5]
[null,"65_66Y6M",1,"F",65,66,6,null,null,"65_66Y6M",10,"F",65,66,6]
[null,"65_66Y7M",1,"F",65,66,7,null,null,"65_66Y7M",10,"F",65,66,7]
[null,"65_66Y8M",1,"F",65,66,8,null,null,"65_66Y8M",10,"F",65,66,8]
[null,"65_66Y9M",1,"F",65,66,9,null,null,"65_66Y9M",10,"F",65,66,9]
[null,"65_66Y10M",1,"F",65,66,10,null,null,"65_66Y10M",10,"F",65,66,10]
[null,"65_66Y11M",1,"F",65,66,11,null,null,"65_66Y11M",10,"F",65,66,11]
[null,"65_67Y0M",1,"F",65,67,0,null,null,"65_67Y0M",10,"F",65,67,0]
[null,"65_67Y1M",1,"F",65,67,1,null,null,"65_67Y1M",10,"F",65,67,1]
[null,"65_67Y2M",1,"F",65,67,2,null,null,"65_67Y2M",10,"F",65,67,2]
[null,"65_67Y3M",1,"F",65,67,3,null,null,"65_67Y3M",10,"F",65,67,3]
[null,"65_67Y4M",1,"F",65,67,4,null,null,"65_67Y4M",10,"F",65,67,4]
[null,"65_67Y5M",1,"F",65,67,5,null,null,"65_67Y5M",10,"F",65,67,5]
[null,"65_67Y6M",1,"F",65,67,6,null,null,"65_67Y6M",10,"F",65,67,6]
[null,"65_67Y7M",1,"F",65,67,7,null,null,"65_67Y7M",10,"F",65,67,7]
[null,"65_67Y8M",1,"F",65,67,8,null,null,"65_67Y8M",10,"F",65,67,8]
[null,"65_67Y9M",1,"F",65,67,9,null,null,"65_67Y9M",10,"F",65,67,9]
[null,"65_67Y10M",1,"F",65,67,10,null,null,"65_67Y10M",10,"F",65,67,10]
[null,"65_67Y11M",1,"F",65,67,11,null,null,"65_67Y11M",10,"F",65,67,11]
[null,"65_68Y0M",1,"F",65,68,0,null,null,"65_68Y0M",10,"F",65,68,0]
[null,"65_68Y1M",1,"F",65,68,1,null,null,"65_68Y1M",10,"F",65,68,1]
[null,"65_68Y2M",1,"F",65,68,2,null,null,"65_68Y2M",10,"F",65,68,2]
[null,"65_68Y3M",1,"F",65,68,3,null,null,"65_68Y3M",10,"F",65,68,3]
[null,"65_68Y4M",1,"F",65,68,4,null,null,"65_68Y4M",10,"F",65,68,4]
[null,"65_68Y5M",1,"F",65,68,5,null,null,"65_68Y5M",10,"F",65,68,5]
[null,"65_68Y6M",1,"F",65,68,6,null,null,"65_68Y6M",10,"F",65,68,6]
[null,"65_68Y7M",1,"F",65,68,7,null,null,"65_68Y7M",10,"F",65,68,7]
[null,"65_68Y8M",1,"F",65,68,8,null,null,"65_68Y8M",10,"F",65,68,8]
[null,"65_68Y9M",1,"F",65,68,9,null,null,"65_68Y9M",10,"F",65,68,9]
[null,"65_68Y10M",1,"F",65,68,10,null,null,"65_68Y10M",10,"F",65,68,10]
[null,"65_68Y11M",1,"F",65,68,11,null,null,"65_68Y11M",10,"F",65,68,11]
[null,"65_69Y0M",1,"F",65,69,0,null,null,"65_69Y0M",10,"F",65,69,0]
[null,"65_69Y1M",1,"F",65,69,1,null,null,"65_69Y1M",10,"F",65,69,1]
[null,"65_69Y2M",1,"F",65,69,2,null,null,"65_69Y2M",10,"F",65,69,2]
[null,"65_69Y3M",1,"F",65,69,3,null,null,"65_69Y3M",10,"F",65,69,3]
[null,"65_69Y4M",1,"F",65,69,4,null,null,"65_69Y4M",10,"F",65,69,4]
[null,"65_69Y5M",1,"F",65,69,5,null,null,"65_69Y5M",10,"F",65,69,5]
[null,"65_69Y6M",1,"F",65,69,6,null,null,"65_69Y6M",10,"F",65,69,6]
[null,"65_69Y7M",1,"F",65,69,7,null,null,"65_69Y7M",10,"F",65,69,7]
[null,"65_69Y8M",1,"F",65,69,8,null,null,"65_69Y8M",10,"F",65,69,8]
[null,"65_69Y9M",1,"F",65,69,9,null,null,"65_69Y9M",10,"F",65,69,9]
[null,"65_69Y10M",1,"F",65,69,10,null,null,"65_69Y10M",10,"F",65,69,10]
[null,"65_69Y11M",1,"F",65,69,11,null,null,"65_69Y11M",10,"F",65,69,11]
[null,"65_70Y0M",1,"F",65,70,0,null,null,"65_70Y0M",10,"F",65,70,0]
[null,"65_70Y1M",1,"F",65,70,1,null,null,"65_70Y1M",10,"F",65,70,1]
[null,"65_70Y2M",1,"F",65,70,2,null,null,"65_70Y2M",10,"F",65,70,2]
[null,"65_70Y3M",1,"F",65,70,3,null,null,"65_70Y3M",10,"F",65,70,3]
[null,"65_70Y4M",1,"F",65,70,4,null,null,"65_70Y4M",10,"F",65,70,4]
[null,{"$f":"E462&\"_\"&F462&\"Y\"&G462&\"M\"","v":"65_70Y5M"},1,"F",65,70,5,null,null,{"$f":"M462&\"_\"&N462&\"Y\"&O462&\"M\"","v":"65_70Y5M"},10,"F",65,70,5]
[null,"65_70Y6M",1,"F",65,70,6,null,null,"65_70Y6M",10,"F",65,70,6]
[null,"65_70Y7M",1,"F",65,70,7,null,null,"65_70Y7M",10,"F",65,70,7]
[null,"65_70Y8M",1,"F",65,70,8,null,null,"65_70Y8M",10,"F",65,70,8]
[null,"65_70Y9M",1,"F",65,70,9,null,null,"65_70Y9M",10,"F",65,70,9]
[null,"65_70Y10M",1,"F",65,70,10,null,null,"65_70Y10M",10,"F",65,70,10]
[null,"65_70Y11M",1,"F",65,70,11,null,null,"65_70Y11M",10,"F",65,70,11]
[null,"65_71Y0M",1,"F",65,71,0,null,null,"65_71Y0M",10,"F",65,71,0]
[null,"65_71Y1M",1,"F",65,71,1,null,null,"65_71Y1M",10,"F",65,71,1]
[null,"65_71Y2M",1,"F",65,71,2,null,null,"65_71Y2M",10,"F",65,71,2]
[null,"65_71Y3M",1,"F",65,71,3,null,null,"65_71Y3M",10,"F",65,71,3]
[null,"65_71Y4M",1,"F",65,71,4,null,null,"65_71Y4M",10,"F",65,71,4]
[null,"65_71Y5M",1,"F",65,71,5,null,null,"65_71Y5M",10,"F",65,71,5]
[null,"65_71Y6M",1,"F",65,71,6,null,null,"65_71Y6M",10,"F",65,71,6]
[null,"65_71Y7M",1,"F",65,71,7,null,null,"65_71Y7M",10,"F",65,71,7]
[null,"65_71Y8M",1,"F",65,71,8,null,null,"65_71Y8M",10,"F",65,71,8]
[null,"65_71Y9M",1,"F",65,71,9,null,null,"65_71Y9M",10,"F",65,71,9]
[null,"65_71Y10M",1,"F",65,71,10,null,null,"65_71Y10M",10,"F",65,71,10]
[null,"65_71Y11M",1,"F",65,71,11,null,null,"65_71Y11M",10,"F",65,71,11]
[null,"65_72Y0M",1,"F",65,72,0,null,null,"65_72Y0M",10,"F",65,72,0]
[null,"65_72Y1M",1,"F",65,72,1,null,null,"65_72Y1M",10,"F",65,72,1]
[null,"65_72Y2M",1,"F",65,72,2,null,null,"65_72Y2M",10,"F",65,72,2]
[null,"65_72Y3M",1,"F",65,72,3,null,null,"65_72Y3M",10,"F",65,72,3]
[null,"65_72Y4M",1,"F",65,72,4,null,null,"65_72Y4M",10,"F",65,72,4]
[null,"65_72Y5M",1,"F",65,72,5,null,null,"65_72Y5M",10,"F",65,72,5]
[null,"65_72Y6M",1,"F",65,72,6,null,null,"65_72Y6M",10,"F",65,72,6]
[null,"65_72Y7M",1,"F",65,72,7,null,null,"65_72Y7M",10,"F",65,72,7]
[null,"65_72Y8M",1,"F",65,72,8,null,null,"65_72Y8M",10,"F",65,72,8]
[null,"65_72Y9M",1,"F",65,72,9,null,null,"65_72Y9M",10,"F",65,72,9]
[null,"65_72Y10M",1,"F",65,72,10,null,null,"65_72Y10M",10,"F",65,72,10]
[null,"65_72Y11M",1,"F",65,72,11,null,null,"65_72Y11M",10,"F",65,72,11]
[null,"65_73Y0M",1,"F",65,73,0,null,null,"65_73Y0M",10,"F",65,73,0]
[null,"65_73Y1M",1,"F",65,73,1,null,null,"65_73Y1M",10,"F",65,73,1]
[null,"65_73Y2M",1,"F",65,73,2,null,null,"65_73Y2M",10,"F",65,73,2]
[null,"65_73Y3M",1,"F",65,73,3,null,null,"65_73Y3M",10,"F",65,73,3]
[null,"65_73Y4M",1,"F",65,73,4,null,null,"65_73Y4M",10,"F",65,73,4]
[null,"65_73Y5M",1,"F",65,73,5,null,null,"65_73Y5M",10,"F",65,73,5]
[null,"65_73Y6M",1,"F",65,73,6,null,null,"65_73Y6M",10,"F",65,73,6]
[null,"65_73Y7M",1,"F",65,73,7,null,null,"65_73Y7M",10,"F",65,73,7]
[null,"65_73Y8M",1,"F",65,73,8,null,null,"65_73Y8M",10,"F",65,73,8]
[null,"65_73Y9M",1,"F",65,73,9,null,null,"65_73Y9M",10,"F",65,73,9]
[null,"65_73Y10M",1,"F",65,73,10,null,null,"65_73Y10M",10,"F",65,73,10]
[null,"65_73Y11M",1,"F",65,73,11,null,null,"65_73Y11M",10,"F",65,73,11]
[null,"65_74Y0M",1,"F",65,74,0,null,null,"65_74Y0M",10,"F",65,74,0]
[null,"65_74Y1M",1,"F",65,74,1,null,null,"65_74Y1M",10,"F",65,74,1]
[null,"65_74Y2M",1,"F",65,74,2,null,null,"65_74Y2M",10,"F",65,74,2]
[null,"65_74Y3M",1,"F",65,74,3,null,null,"65_74Y3M",10,"F",65,74,3]
[null,"65_74Y4M",1,"F",65,74,4,null,null,"65_74Y4M",10,"F",65,74,4]
[null,"65_74Y5M",1,"F",65,74,5,null,null,"65_74Y5M",10,"F",65,74,5]
[null,"65_74Y6M",1,"F",65,74,6,null,null,"65_74Y6M",10,"F",65,74,6]
[null,"65_74Y7M",1,"F",65,74,7,null,null,"65_74Y7M",10,"F",65,74,7]
[null,"65_74Y8M",1,"F",65,74,8,null,null,"65_74Y8M",10,"F",65,74,8]
[null,"65_74Y9M",1,"F",65,74,9,null,null,"65_74Y9M",10,"F",65,74,9]
[null,"65_74Y10M",1,"F",65,74,10,null,null,"65_74Y10M",10,"F",65,74,10]
[null,"65_74Y11M",1,"F",65,74,11,null,null,"65_74Y11M",10,"F",65,74,11]
[null,"66_54Y0M",0.54900000000000004,"M",66,54,0,null,null,"66_54Y0M",10,"M",66,54,0]
[null,"66_54Y1M",0.55100000000000005,"M",66,54,1,null,null,"66_54Y1M",10,"M",66,54,1]
[null,"66_54Y2M",0.55400000000000005,"M",66,54,2,null,null,"66_54Y2M",10,"M",66,54,2]
[null,"66_54Y3M",0.55600000000000005,"M",66,54,3,null,null,"66_54Y3M",10,"M",66,54,3]
[null,"66_54Y4M",0.55800000000000005,"M",66,54,4,null,null,"66_54Y4M",10,"M",66,54,4]
[null,"66_54Y5M",0.56000000000000005,"M",66,54,5,null,null,"66_54Y5M",10,"M",66,54,5]
[null,"66_54Y6M",0.56200000000000006,"M",66,54,6,null,null,"66_54Y6M",10,"M",66,54,6]
[null,"66_54Y7M",0.56399999999999995,"M",66,54,7,null,null,"66_54Y7M",10,"M",66,54,7]
[null,"66_54Y8M",0.56599999999999995,"M",66,54,8,null,null,"66_54Y8M",10,"M",66,54,8]
[null,{"$f":"E526&\"_\"&F526&\"Y\"&G526&\"M\"","v":"66_54Y9M"},0.56799999999999995,"M",66,54,9,null,null,{"$f":"M526&\"_\"&N526&\"Y\"&O526&\"M\"","v":"66_54Y9M"},10,"M",66,54,9]
[null,"66_54Y10M",0.56999999999999995,"M",66,54,10,null,null,"66_54Y10M",10,"M",66,54,10]
[null,"66_54Y11M",0.57199999999999995,"M",66,54,11,null,null,"66_54Y11M",10,"M",66,54,11]
[null,"66_55Y0M",0.57399999999999995,"M",66,55,0,null,null,"66_55Y0M",10,"M",66,55,0]
[null,"66_55Y1M",0.57699999999999996,"M",66,55,1,null,null,"66_55Y1M",10,"M",66,55,1]
[null,"66_55Y2M",0.57899999999999996,"M",66,55,2,null,null,"66_55Y2M",10,"M",66,55,2]
[null,"66_55Y3M",0.58099999999999996,"M",66,55,3,null,null,"66_55Y3M",10,"M",66,55,3]
[null,"66_55Y4M",0.58299999999999996,"M",66,55,4,null,null,"66_55Y4M",10,"M",66,55,4]
[null,"66_55Y5M",0.58499999999999996,"M",66,55,5,null,null,"66_55Y5M",10,"M",66,55,5]
[null,"66_55Y6M",0.58799999999999997,"M",66,55,6,null,null,"66_55Y6M",10,"M",66,55,6]
[null,"66_55Y7M",0.59,"M",66,55,7,null,null,"66_55Y7M",10,"M",66,55,7]
[null,"66_55Y8M",0.59199999999999997,"M",66,55,8,null,null,"66_55Y8M",10,"M",66,55,8]
[null,"66_55Y9M",0.59399999999999997,"M",66,55,9,null,null,"66_55Y9M",10,"M",66,55,9]
[null,"66_55Y10M",0.59699999999999998,"M",66,55,10,null,null,"66_55Y10M",10,"M",66,55,10]
[null,"66_55Y11M",0.59899999999999998,"M",66,55,11,null,null,"66_55Y11M",10,"M",66,55,11]
[null,"66_56Y0M",0.60099999999999998,"M",66,56,0,null,null,"66_56Y0M",10,"M",66,56,0]
[null,"66_56Y1M",0.60299999999999998,"M",66,56,1,null,null,"66_56Y1M",10,"M",66,56,1]
[null,"66_56Y2M",0.60599999999999998,"M",66,56,2,null,null,"66_56Y2M",10,"M",66,56,2]
[null,"66_56Y3M",0.60799999999999998,"M",66,56,3,null,null,"66_56Y3M",10,"M",66,56,3]
[null,"66_56Y4M",0.61,"M",66,56,4,null,null,"66_56Y4M",10,"M",66,56,4]
[null,"66_56Y5M",0.61299999999999999,"M",66,56,5,null,null,"66_56Y5M",10,"M",66,56,5]
[null,"66_56Y6M",0.61499999999999999,"M",66,56,6,null,null,"66_56Y6M",10,"M",66,56,6]
[null,"66_56Y7M",0.61799999999999999,"M",66,56,7,null,null,"66_56Y7M",10,"M",66,56,7]
[null,"66_56Y8M",0.62,"M",66,56,8,null,null,"66_56Y8M",10,"M",66,56,8]
[null,"66_56Y9M",0.622,"M",66,56,9,null,null,"66_56Y9M",10,"M",66,56,9]
[null,"66_56Y10M",0.625,"M",66,56,10,null,null,"66_56Y10M",10,"M",66,56,10]
[null,"66_56Y11M",0.627,"M",66,56,11,null,null,"66_56Y11M",10,"M",66,56,11]
[null,"66_57Y0M",0.629,"M",66,57,0,null,null,"66_57Y0M",10,"M",66,57,0]
[null,"66_57Y1M",0.63200000000000001,"M",66,57,1,null,null,"66_57Y1M",10,"M",66,57,1]
[null,"66_57Y2M",0.63500000000000001,"M",66,57,2,null,null,"66_57Y2M",10,"M",66,57,2]
[null,"66_57Y3M",0.63700000000000001,"M",66,57,3,null,null,"66_57Y3M",10,"M",66,57,3]
[null,"66_57Y4M",0.64,"M",66,57,4,null,null,"66_57Y4M",10,"M",66,57,4]
[null,"66_57Y5M",0.64200000000000002,"M",66,57,5,null,null,"66_57Y5M",10,"M",66,57,5]
[null,"66_57Y6M",0.64500000000000002,"M",66,57,6,null,null,"66_57Y6M",10,"M",66,57,6]
[null,"66_57Y7M",0.64700000000000002,"M",66,57,7,null,null,"66_57Y7M",10,"M",66,57,7]
[null,"66_57Y8M",0.65,"M",66,57,8,null,null,"66_57Y8M",10,"M",66,57,8]
[null,"66_57Y9M",0.65200000000000002,"M",66,57,9,null,null,"66_57Y9M",10,"M",66,57,9]
[null,"66_57Y10M",0.65500000000000003,"M",66,57,10,null,null,"66_57Y10M",10,"M",66,57,10]
[null,"66_57Y11M",0.65700000000000003,"M",66,57,11,null,null,"66_57Y11M",10,"M",66,57,11]
[null,"66_58Y0M",0.66,"M",66,58,0,null,null,"66_58Y0M",10,"M",66,58,0]
[null,"66_58Y1M",0.66300000000000003,"M",66,58,1,null,null,"66_58Y1M",10,"M",66,58,1]
[null,"66_58Y2M",0.66500000000000004,"M",66,58,2,null,null,"66_58Y2M",10,"M",66,58,2]
[null,"66_58Y3M",0.66800000000000004,"M",66,58,3,null,null,"66_58Y3M",10,"M",66,58,3]
[null,"66_58Y4M",0.67100000000000004,"M",66,58,4,null,null,"66_58Y4M",10,"M",66,58,4]
[null,"66_58Y5M",0.67300000000000004,"M",66,58,5,null,null,"66_58Y5M",10,"M",66,58,5]
[null,"66_58Y6M",0.67600000000000005,"M",66,58,6,null,null,"66_58Y6M",10,"M",66,58,6]
[null,"66_58Y7M",0.67900000000000005,"M",66,58,7,null,null,"66_58Y7M",10,"M",66,58,7]
[null,"66_58Y8M",0.68100000000000005,"M",66,58,8,null,null,"66_58Y8M",10,"M",66,58,8]
[null,"66_58Y9M",0.68400000000000005,"M",66,58,9,null,null,"66_58Y9M",10,"M",66,58,9]
[null,"66_58Y10M",0.68700000000000006,"M",66,58,10,null,null,"66_58Y10M",10,"M",66,58,10]
[null,"66_58Y11M",0.69,"M",66,58,11,null,null,"66_58Y11M",10,"M",66,58,11]
[null,"66_59Y0M",0.69199999999999995,"M",66,59,0,null,null,"66_59Y0M",10,"M",66,59,0]
[null,"66_59Y1M",0.69499999999999995,"M",66,59,1,null,null,"66_59Y1M",10,"M",66,59,1]
[null,"66_59Y2M",0.69799999999999995,"M",66,59,2,null,null,"66_59Y2M",10,"M",66,59,2]
[null,"66_59Y3M",0.70099999999999996,"M",66,59,3,null,null,"66_59Y3M",10,"M",66,59,3]
[null,"66_59Y4M",0.70399999999999996,"M",66,59,4,null,null,"66_59Y4M",10,"M",66,59,4]
[null,"66_59Y5M",0.70699999999999996,"M",66,59,5,null,null,"66_59Y5M",10,"M",66,59,5]
[null,"66_59Y6M",0.71,"M",66,59,6,null,null,"66_59Y6M",10,"M",66,59,6]
[null,"66_59Y7M",0.71299999999999997,"M",66,59,7,null,null,"66_59Y7M",10,"M",66,59,7]
[null,"66_59Y8M",0.71599999999999997,"M",66,59,8,null,null,"66_59Y8M",10,"M",66,59,8]
[null,"66_59Y9M",0.71799999999999997,"M",66,59,9,null,null,"66_59Y9M",10,"M",66,59,9]
[null,"66_59Y10M",0.72099999999999997,"M",66,59,10,null,null,"66_59Y10M",10,"M",66,59,10]
[null,"66_59Y11M",0.72399999999999998,"M",66,59,11,null,null,"66_59Y11M",10,"M",66,59,11]
[null,"66_60Y0M",0.72699999999999998,"M",66,60,0,null,null,"66_60Y0M",10,"M",66,60,0]
[null,{"$f":"E590&\"_\"&F590&\"Y\"&G590&\"M\"","v":"66_60Y1M"},0.73,"M",66,60,1,null,null,{"$f":"M590&\"_\"&N590&\"Y\"&O590&\"M\"","v":"66_60Y1M"},10,"M",66,60,1]
[null,"66_60Y2M",0.73399999999999999,"M",66,60,2,null,null,"66_60Y2M",10,"M",66,60,2]
[null,"66_60Y3M",0.73699999999999999,"M",66,60,3,null,null,"66_60Y3M",10,"M",66,60,3]
[null,"66_60Y4M",0.74,"M",66,60,4,null,null,"66_60Y4M",10,"M",66,60,4]
[null,"66_60Y5M",0.74299999999999999,"M",66,60,5,null,null,"66_60Y5M",10,"M",66,60,5]
[null,"66_60Y6M",0.746,"M",66,60,6,null,null,"66_60Y6M",10,"M",66,60,6]
[null,"66_60Y7M",0.749,"M",66,60,7,null,null,"66_60Y7M",10,"M",66,60,7]
[null,"66_60Y8M",0.752,"M",66,60,8,null,null,"66_60Y8M",10,"M",66,60,8]
[null,"66_60Y9M",0.755,"M",66,60,9,null,null,"66_60Y9M",10,"M",66,60,9]
[null,"66_60Y10M",0.75800000000000001,"M",66,60,10,null,null,"66_60Y10M",10,"M",66,60,10]
[null,"66_60Y11M",0.76200000000000001,"M",66,60,11,null,null,"66_60Y11M",10,"M",66,60,11]
[null,"66_61Y0M",0.76500000000000001,"M",66,61,0,null,null,"66_61Y0M",10,"M",66,61,0]
[null,"66_61Y1M",0.76800000000000002,"M",66,61,1,null,null,"66_61Y1M",10,"M",66,61,1]
[null,"66_61Y2M",0.77200000000000002,"M",66,61,2,null,null,"66_61Y2M",10,"M",66,61,2]
[null,"66_61Y3M",0.77500000000000002,"M",66,61,3,null,null,"66_61Y3M",10,"M",66,61,3]
[null,"66_61Y4M",0.77800000000000002,"M",66,61,4,null,null,"66_61Y4M",10,"M",66,61,4]
[null,"66_61Y5M",0.78200000000000003,"M",66,61,5,null,null,"66_61Y5M",10,"M",66,61,5]
[null,"66_61Y6M",0.78500000000000003,"M",66,61,6,null,null,"66_61Y6M",10,"M",66,61,6]
[null,"66_61Y7M",0.78800000000000003,"M",66,61,7,null,null,"66_61Y7M",10,"M",66,61,7]
[null,"66_61Y8M",0.79200000000000004,"M",66,61,8,null,null,"66_61Y8M",10,"M",66,61,8]
[null,"66_61Y9M",0.79500000000000004,"M",66,61,9,null,null,"66_61Y9M",10,"M",66,61,9]
[null,"66_61Y10M",0.79800000000000004,"M",66,61,10,null,null,"66_61Y10M",10,"M",66,61,10]
[null,"66_61Y11M",0.80200000000000005,"M",66,61,11,null,null,"66_61Y11M",10,"M",66,61,11]
[null,"66_62Y0M",0.80500000000000005,"M",66,62,0,null,null,"66_62Y0M",10,"M",66,62,0]
[null,"66_62Y1M",0.80900000000000005,"M",66,62,1,null,null,"66_62Y1M",10,"M",66,62,1]
[null,"66_62Y2M",0.81200000000000006,"M",66,62,2,null,null,"66_62Y2M",10,"M",66,62,2]
[null,"66_62Y3M",0.81599999999999995,"M",66,62,3,null,null,"66_62Y3M",10,"M",66,62,3]
[null,"66_62Y4M",0.82,"M",66,62,4,null,null,"66_62Y4M",10,"M",66,62,4]
[null,"66_62Y5M",0.82299999999999995,"M",66,62,5,null,null,"66_62Y5M",10,"M",66,62,5]
[null,"66_62Y6M",0.82699999999999996,"M",66,62,6,null,null,"66_62Y6M",10,"M",66,62,6]
[null,"66_62Y7M",0.83099999999999996,"M",66,62,7,null,null,"66_62Y7M",10,"M",66,62,7]
[null,"66_62Y8M",0.83399999999999996,"M",66,62,8,null,null,"66_62Y8M",10,"M",66,62,8]
[null,"66_62Y9M",0.83799999999999997,"M",66,62,9,null,null,"66_62Y9M",10,"M",66,62,9]
[null,"66_62Y10M",0.84099999999999997,"M",66,62,10,null,null,"66_62Y10M",10,"M",66,62,10]
[null,"66_62Y11M",0.84499999999999997,"M",66,62,11,null,null,"66_62Y11M",10,"M",66,62,11]
[null,"66_63Y0M",0.84899999999999998,"M",66,63,0,null,null,"66_63Y0M",10,"M",66,63,0]
[null,"66_63Y1M",0.85299999999999998,"M",66,63,1,null,null,"66_63Y1M",10,"M",66,63,1]
[null,"66_63Y2M",0.85699999999999998,"M",66,63,2,null,null,"66_63Y2M",10,"M",66,63,2]
[null,"66_63Y3M",0.86099999999999999,"M",66,63,3,null,null,"66_63Y3M",10,"M",66,63,3]
[null,"66_63Y4M",0.86399999999999999,"M",66,63,4,null,null,"66_63Y4M",10,"M",66,63,4]
[null,"66_63Y5M",0.86799999999999999,"M",66,63,5,null,null,"66_63Y5M",10,"M",66,63,5]
[null,"66_63Y6M",0.872,"M",66,63,6,null,null,"66_63Y6M",10,"M",66,63,6]
[null,"66_63Y7M",0.876,"M",66,63,7,null,null,"66_63Y7M",10,"M",66,63,7]
[null,"66_63Y8M",0.88,"M",66,63,8,null,null,"66_63Y8M",10,"M",66,63,8]
[null,"66_63Y9M",0.88400000000000001,"M",66,63,9,null,null,"66_63Y9M",10,"M",66,63,9]
[null,"66_63Y10M",0.88800000000000001,"M",66,63,10,null,null,"66_63Y10M",10,"M",66,63,10]
[null,"66_63Y11M",0.89200000000000002,"M",66,63,11,null,null,"66_63Y11M",10,"M",66,63,11]
[null,"66_64Y0M",0.89600000000000002,"M",66,64,0,null,null,"66_64Y0M",10,"M",66,64,0]
[null,"66_64Y1M",0.9,"M",66,64,1,null,null,"66_64Y1M",10,"M",66,64,1]
[null,"66_64Y2M",0.90400000000000003,"M",66,64,2,null,null,"66_64Y2M",10,"M",66,64,2]
[null,"66_64Y3M",0.90900000000000003,"M",66,64,3,null,null,"66_64Y3M",10,"M",66,64,3]
[null,"66_64Y4M",0.91300000000000003,"M",66,64,4,null,null,"66_64Y4M",10,"M",66,64,4]
[null,"66_64Y5M",0.91700000000000004,"M",66,64,5,null,null,"66_64Y5M",10,"M",66,64,5]
[null,"66_64Y6M",0.92100000000000004,"M",66,64,6,null,null,"66_64Y6M",10,"M",66,64,6]
[null,"66_64Y7M",0.92600000000000005,"M",66,64,7,null,null,"66_64Y7M",10,"M",66,64,7]
[null,"66_64Y8M",0.93,"M",66,64,8,null,null,"66_64Y8M",10,"M",66,64,8]
[null,"66_64Y9M",0.93400000000000005,"M",66,64,9,null,null,"66_64Y9M",10,"M",66,64,9]
[null,"66_64Y10M",0.93799999999999994,"M",66,64,10,null,null,"66_64Y10M",10,"M",66,64,10]
[null,"66_64Y11M",0.94299999999999995,"M",66,64,11,null,null,"66_64Y11M",10,"M",66,64,11]
[null,"66_65Y0M",0.94699999999999995,"M",66,65,0,null,null,"66_65Y0M",10,"M",66,65,0]
[null,"66_65Y1M",0.95199999999999996,"M",66,65,1,null,null,"66_65Y1M",10,"M",66,65,1]
[null,"66_65Y2M",0.95599999999999996,"M",66,65,2,null,null,"66_65Y2M",10,"M",66,65,2]
[null,"66_65Y3M",0.96099999999999997,"M",66,65,3,null,null,"66_65Y3M",10,"M",66,65,3]
[null,"66_65Y4M",0.96499999999999997,"M",66,65,4,null,null,"66_65Y4M",10,"M",66,65,4]
[null,{"$f":"E654&\"_\"&F654&\"Y\"&G654&\"M\"","v":"66_65Y5M"},0.97,"M",66,65,5,null,null,{"$f":"M654&\"_\"&N654&\"Y\"&O654&\"M\"","v":"66_65Y5M"},10,"M",66,65,5]
[null,"66_65Y6M",0.97499999999999998,"M",66,65,6,null,null,"66_65Y6M",10,"M",66,65,6]
[null,"66_65Y7M",0.97899999999999998,"M",66,65,7,null,null,"66_65Y7M",10,"M",66,65,7]
[null,"66_65Y8M",0.98399999999999999,"M",66,65,8,null,null,"66_65Y8M",10,"M",66,65,8]
[null,"66_65Y9M",0.98799999999999999,"M",66,65,9,null,null,"66_65Y9M",10,"M",66,65,9]
[null,"66_65Y10M",0.99299999999999999,"M",66,65,10,null,null,"66_65Y10M",10,"M",66,65,10]
[null,"66_65Y11M",0.995,"M",66,65,11,null,null,"66_65Y11M",10,"M",66,65,11]
[null,"66_66Y0M",1,"M",66,66,0,null,null,"66_66Y0M",10,"M",66,66,0]
[null,"66_66Y1M",1,"M",66,66,1,null,null,"66_66Y1M",10,"M",66,66,1]
[null,"66_66Y2M",1,"M",66,66,2,null,null,"66_66Y2M",10,"M",66,66,2]
[null,"66_66Y3M",1,"M",66,66,3,null,null,"66_66Y3M",10,"M",66,66,3]
[null,"66_66Y4M",1,"M",66,66,4,null,null,"66_66Y4M",10,"M",66,66,4]
[null,"66_66Y5M",1,"M",66,66,5,null,null,"66_66Y5M",10,"M",66,66,5]
[null,"66_66Y6M",1,"M",66,66,6,null,null,"66_66Y6M",10,"M",66,66,6]
[null,"66_66Y7M",1,"M",66,66,7,null,null,"66_66Y7M",10,"M",66,66,7]
[null,"66_66Y8M",1,"M",66,66,8,null,null,"66_66Y8M",10,"M",66,66,8]
[null,"66_66Y9M",1,"M",66,66,9,null,null,"66_66Y9M",10,"M",66,66,9]
[null,"66_66Y10M",1,"M",66,66,10,null,null,"66_66Y10M",10,"M",66,66,10]
[null,"66_66Y11M",1,"M",66,66,11,null,null,"66_66Y11M",10,"M",66,66,11]
[null,"66_67Y0M",1,"M",66,67,0,null,null,"66_67Y0M",10,"M",66,67,0]
[null,"66_67Y1M",1,"M",66,67,1,null,null,"66_67Y1M",10,"M",66,67,1]
[null,"66_67Y2M",1,"M",66,67,2,null,null,"66_67Y2M",10,"M",66,67,2]
[null,"66_67Y3M",1,"M",66,67,3,null,null,"66_67Y3M",10,"M",66,67,3]
[null,"66_67Y4M",1,"M",66,67,4,null,null,"66_67Y4M",10,"M",66,67,4]
[null,"66_67Y5M",1,"M",66,67,5,null,null,"66_67Y5M",10,"M",66,67,5]
[null,"66_67Y6M",1,"M",66,67,6,null,null,"66_67Y6M",10,"M",66,67,6]
[null,"66_67Y7M",1,"M",66,67,7,null,null,"66_67Y7M",10,"M",66,67,7]
[null,"66_67Y8M",1,"M",66,67,8,null,null,"66_67Y8M",10,"M",66,67,8]
[null,"66_67Y9M",1,"M",66,67,9,null,null,"66_67Y9M",10,"M",66,67,9]
[null,"66_67Y10M",1,"M",66,67,10,null,null,"66_67Y10M",10,"M",66,67,10]
[null,"66_67Y11M",1,"M",66,67,11,null,null,"66_67Y11M",10,"M",66,67,11]
[null,"66_68Y0M",1,"M",66,68,0,null,null,"66_68Y0M",10,"M",66,68,0]
[null,"66_68Y1M",1,"M",66,68,1,null,null,"66_68Y1M",10,"M",66,68,1]
[null,"66_68Y2M",1,"M",66,68,2,null,null,"66_68Y2M",10,"M",66,68,2]
[null,"66_68Y3M",1,"M",66,68,3,null,null,"66_68Y3M",10,"M",66,68,3]
[null,"66_68Y4M",1,"M",66,68,4,null,null,"66_68Y4M",10,"M",66,68,4]
[null,"66_68Y5M",1,"M",66,68,5,null,null,"66_68Y5M",10,"M",66,68,5]
[null,"66_68Y6M",1,"M",66,68,6,null,null,"66_68Y6M",10,"M",66,68,6]
[null,"66_68Y7M",1,"M",66,68,7,null,null,"66_68Y7M",10,"M",66,68,7]
[null,"66_68Y8M",1,"M",66,68,8,null,null,"66_68Y8M",10,"M",66,68,8]
[null,"66_68Y9M",1,"M",66,68,9,null,null,"66_68Y9M",10,"M",66,68,9]
[null,"66_68Y10M",1,"M",66,68,10,null,null,"66_68Y10M",10,"M",66,68,10]
[null,"66_68Y11M",1,"M",66,68,11,null,null,"66_68Y11M",10,"M",66,68,11]
[null,"66_69Y0M",1,"M",66,69,0,null,null,"66_69Y0M",10,"M",66,69,0]
[null,"66_69Y1M",1,"M",66,69,1,null,null,"66_69Y1M",10,"M",66,69,1]
[null,"66_69Y2M",1,"M",66,69,2,null,null,"66_69Y2M",10,"M",66,69,2]
[null,"66_69Y3M",1,"M",66,69,3,null,null,"66_69Y3M",10,"M",66,69,3]
[null,"66_69Y4M",1,"M",66,69,4,null,null,"66_69Y4M",10,"M",66,69,4]
[null,"66_69Y5M",1,"M",66,69,5,null,null,"66_69Y5M",10,"M",66,69,5]
[null,"66_69Y6M",1,"M",66,69,6,null,null,"66_69Y6M",10,"M",66,69,6]
[null,"66_69Y7M",1,"M",66,69,7,null,null,"66_69Y7M",10,"M",66,69,7]
[null,"66_69Y8M",1,"M",66,69,8,null,null,"66_69Y8M",10,"M",66,69,8]
[null,"66_69Y9M",1,"M",66,69,9,null,null,"66_69Y9M",10,"M",66,69,9]
[null,"66_69Y10M",1,"M",66,69,10,null,null,"66_69Y10M",10,"M",66,69,10]
[null,"66_69Y11M",1,"M",66,69,11,null,null,"66_69Y11M",10,"M",66,69,11]
[null,"66_70Y0M",1,"M",66,70,0,null,null,"66_70Y0M",10,"M",66,70,0]
[null,"66_70Y1M",1,"M",66,70,1,null,null,"66_70Y1M",10,"M",66,70,1]
[null,"66_70Y2M",1,"M",66,70,2,null,null,"66_70Y2M",10,"M",66,70,2]
[null,"66_70Y3M",1,"M",66,70,3,null,null,"66_70Y3M",10,"M",66,70,3]
[null,"66_70Y4M",1,"M",66,70,4,null,null,"66_70Y4M",10,"M",66,70,4]
[null,"66_70Y5M",1,"M",66,70,5,null,null,"66_70Y5M",10,"M",66,70,5]
[null,"66_70Y6M",1,"M",66,70,6,null,null,"66_70Y6M",10,"M",66,70,6]
[null,"66_70Y7M",1,"M",66,70,7,null,null,"66_70Y7M",10,"M",66,70,7]
[null,"66_70Y8M",1,"M",66,70,8,null,null,"66_70Y8M",10,"M",66,70,8]
[null,{"$f":"E718&\"_\"&F718&\"Y\"&G718&\"M\"","v":"66_70Y9M"},1,"M",66,70,9,null,null,{"$f":"M718&\"_\"&N718&\"Y\"&O718&\"M\"","v":"66_70Y9M"},10,"M",66,70,9]
[null,"66_70Y10M",1,"M",66,70,10,null,null,"66_70Y10M",10,"M",66,70,10]
[null,"66_70Y11M",1,"M",66,70,11,null,null,"66_70Y11M",10,"M",66,70,11]
[null,"66_71Y0M",1,"M",66,71,0,null,null,"66_71Y0M",10,"M",66,71,0]
[null,"66_71Y1M",1,"M",66,71,1,null,null,"66_71Y1M",10,"M",66,71,1]
[null,"66_71Y2M",1,"M",66,71,2,null,null,"66_71Y2M",10,"M",66,71,2]
[null,"66_71Y3M",1,"M",66,71,3,null,null,"66_71Y3M",10,"M",66,71,3]
[null,"66_71Y4M",1,"M",66,71,4,null,null,"66_71Y4M",10,"M",66,71,4]
[null,"66_71Y5M",1,"M",66,71,5,null,null,"66_71Y5M",10,"M",66,71,5]
[null,"66_71Y6M",1,"M",66,71,6,null,null,"66_71Y6M",10,"M",66,71,6]
[null,"66_71Y7M",1,"M",66,71,7,null,null,"66_71Y7M",10,"M",66,71,7]
[null,"66_71Y8M",1,"M",66,71,8,null,null,"66_71Y8M",10,"M",66,71,8]
[null,"66_71Y9M",1,"M",66,71,9,null,null,"66_71Y9M",10,"M",66,71,9]
[null,"66_71Y10M",1,"M",66,71,10,null,null,"66_71Y10M",10,"M",66,71,10]
[null,"66_71Y11M",1,"M",66,71,11,null,null,"66_71Y11M",10,"M",66,71,11]
[null,"66_72Y0M",1,"M",66,72,0,null,null,"66_72Y0M",10,"M",66,72,0]
[null,"66_72Y1M",1,"M",66,72,1,null,null,"66_72Y1M",10,"M",66,72,1]
[null,"66_72Y2M",1,"M",66,72,2,null,null,"66_72Y2M",10,"M",66,72,2]
[null,"66_72Y3M",1,"M",66,72,3,null,null,"66_72Y3M",10,"M",66,72,3]
[null,"66_72Y4M",1,"M",66,72,4,null,null,"66_72Y4M",10,"M",66,72,4]
[null,"66_72Y5M",1,"M",66,72,5,null,null,"66_72Y5M",10,"M",66,72,5]
[null,"66_72Y6M",1,"M",66,72,6,null,null,"66_72Y6M",10,"M",66,72,6]
[null,"66_72Y7M",1,"M",66,72,7,null,null,"66_72Y7M",10,"M",66,72,7]
[null,"66_72Y8M",1,"M",66,72,8,null,null,"66_72Y8M",10,"M",66,72,8]
[null,"66_72Y9M",1,"M",66,72,9,null,null,"66_72Y9M",10,"M",66,72,9]
[null,"66_72Y10M",1,"M",66,72,10,null,null,"66_72Y10M",10,"M",66,72,10]
[null,"66_72Y11M",1,"M",66,72,11,null,null,"66_72Y11M",10,"M",66,72,11]
[null,"66_73Y0M",1,"M",66,73,0,null,null,"66_73Y0M",10,"M",66,73,0]
[null,"66_73Y1M",1,"M",66,73,1,null,null,"66_73Y1M",10,"M",66,73,1]
[null,"66_73Y2M",1,"M",66,73,2,null,null,"66_73Y2M",10,"M",66,73,2]
[null,"66_73Y3M",1,"M",66,73,3,null,null,"66_73Y3M",10,"M",66,73,3]
[null,"66_73Y4M",1,"M",66,73,4,null,null,"66_73Y4M",10,"M",66,73,4]
[null,"66_73Y5M",1,"M",66,73,5,null,null,"66_73Y5M",10,"M",66,73,5]
[null,"66_73Y6M",1,"M",66,73,6,null,null,"66_73Y6M",10,"M",66,73,6]
[null,"66_73Y7M",1,"M",66,73,7,null,null,"66_73Y7M",10,"M",66,73,7]
[null,"66_73Y8M",1,"M",66,73,8,null,null,"66_73Y8M",10,"M",66,73,8]
[null,"66_73Y9M",1,"M",66,73,9,null,null,"66_73Y9M",10,"M",66,73,9]
[null,"66_73Y10M",1,"M",66,73,10,null,null,"66_73Y10M",10,"M",66,73,10]
[null,"66_73Y11M",1,"M",66,73,11,null,null,"66_73Y11M",10,"M",66,73,11]
[null,"66_74Y0M",1,"M",66,74,0,null,null,"66_74Y0M",10,"M",66,74,0]
[null,"66_74Y1M",1,"M",66,74,1,null,null,"66_74Y1M",10,"M",66,74,1]
[null,"66_74Y2M",1,"M",66,74,2,null,null,"66_74Y2M",10,"M",66,74,2]
[null,"66_74Y3M",1,"M",66,74,3,null,null,"66_74Y3M",10,"M",66,74,3]
[null,"66_74Y4M",1,"M",66,74,4,null,null,"66_74Y4M",10,"M",66,74,4]
[null,"66_74Y5M",1,"M",66,74,5,null,null,"66_74Y5M",10,"M",66,74,5]
[null,"66_74Y6M",1,"M",66,74,6,null,null,"66_74Y6M",10,"M",66,74,6]
[null,"66_74Y7M",1,"M",66,74,7,null,null,"66_74Y7M",10,"M",66,74,7]
[null,"66_74Y8M",1,"M",66,74,8,null,null,"66_74Y8M",10,"M",66,74,8]
[null,"66_74Y9M",1,"M",66,74,9,null,null,"66_74Y9M",10,"M",66,74,9]
[null,"66_74Y10M",1,"M",66,74,10,null,null,"66_74Y10M",10,"M",66,74,10]
[null,"66_74Y11M",1,"M",66,74,11,null,null,"66_74Y11M",10,"M",66,74,11]
[null,"66_54Y0M",0.54900000000000004,"F",66,54,0,null,null,"66_54Y0M",10,"F",66,54,0]
[null,"66_54Y1M",0.55100000000000005,"F",66,54,1,null,null,"66_54Y1M",10,"F",66,54,1]
[null,"66_54Y2M",0.55400000000000005,"F",66,54,2,null,null,"66_54Y2M",10,"F",66,54,2]
[null,"66_54Y3M",0.55600000000000005,"F",66,54,3,null,null,"66_54Y3M",10,"F",66,54,3]
[null,"66_54Y4M",0.55800000000000005,"F",66,54,4,null,null,"66_54Y4M",10,"F",66,54,4]
[null,"66_54Y5M",0.56000000000000005,"F",66,54,5,null,null,"66_54Y5M",10,"F",66,54,5]
[null,"66_54Y6M",0.56200000000000006,"F",66,54,6,null,null,"66_54Y6M",10,"F",66,54,6]
[null,"66_54Y7M",0.56399999999999995,"F",66,54,7,null,null,"66_54Y7M",10,"F",66,54,7]
[null,"66_54Y8M",0.56599999999999995,"F",66,54,8,null,null,"66_54Y8M",10,"F",66,54,8]
[null,"66_54Y9M",0.56799999999999995,"F",66,54,9,null,null,"66_54Y9M",10,"F",66,54,9]
[null,"66_54Y10M",0.56999999999999995,"F",66,54,10,null,null,"66_54Y10M",10,"F",66,54,10]
[null,"66_54Y11M",0.57199999999999995,"F",66,54,11,null,null,"66_54Y11M",10,"F",66,54,11]
[null,"66_55Y0M",0.57399999999999995,"F",66,55,0,null,null,"66_55Y0M",10,"F",66,55,0]
[null,{"$f":"E782&\"_\"&F782&\"Y\"&G782&\"M\"","v":"66_55Y1M"},0.57699999999999996,"F",66,55,1,null,null,{"$f":"M782&\"_\"&N782&\"Y\"&O782&\"M\"","v":"66_55Y1M"},10,"F",66,55,1]
[null,"66_55Y2M",0.57899999999999996,"F",66,55,2,null,null,"66_55Y2M",10,"F",66,55,2]
[null,"66_55Y3M",0.58099999999999996,"F",66,55,3,null,null,"66_55Y3M",10,"F",66,55,3]
[null,"66_55Y4M",0.58299999999999996,"F",66,55,4,null,null,"66_55Y4M",10,"F",66,55,4]
[null,"66_55Y5M",0.58499999999999996,"F",66,55,5,null,null,"66_55Y5M",10,"F",66,55,5]
[null,"66_55Y6M",0.58799999999999997,"F",66,55,6,null,null,"66_55Y6M",10,"F",66,55,6]
[null,"66_55Y7M",0.59,"F",66,55,7,null,null,"66_55Y7M",10,"F",66,55,7]
[null,"66_55Y8M",0.59199999999999997,"F",66,55,8,null,null,"66_55Y8M",10,"F",66,55,8]
[null,"66_55Y9M",0.59399999999999997,"F",66,55,9,null,null,"66_55Y9M",10,"F",66,55,9]
[null,"66_55Y10M",0.59699999999999998,"F",66,55,10,null,null,"66_55Y10M",10,"F",66,55,10]
[null,"66_55Y11M",0.59899999999999998,"F",66,55,11,null,null,"66_55Y11M",10,"F",66,55,11]
[null,"66_56Y0M",0.60099999999999998,"F",66,56,0,null,null,"66_56Y0M",10,"F",66,56,0]
[null,"66_56Y1M",0.60299999999999998,"F",66,56,1,null,null,"66_56Y1M",10,"F",66,56,1]
[null,"66_56Y2M",0.60599999999999998,"F",66,56,2,null,null,"66_56Y2M",10,"F",66,56,2]
[null,"66_56Y3M",0.60799999999999998,"F",66,56,3,null,null,"66_56Y3M",10,"F",66,56,3]
[null,"66_56Y4M",0.61,"F",66,56,4,null,null,"66_56Y4M",10,"F",66,56,4]
[null,"66_56Y5M",0.61299999999999999,"F",66,56,5,null,null,"66_56Y5M",10,"F",66,56,5]
[null,"66_56Y6M",0.61499999999999999,"F",66,56,6,null,null,"66_56Y6M",10,"F",66,56,6]
[null,"66_56Y7M",0.61799999999999999,"F",66,56,7,null,null,"66_56Y7M",10,"F",66,56,7]
[null,"66_56Y8M",0.62,"F",66,56,8,null,null,"66_56Y8M",10,"F",66,56,8]
[null,"66_56Y9M",0.622,"F",66,56,9,null,null,"66_56Y9M",10,"F",66,56,9]
[null,"66_56Y10M",0.625,"F",66,56,10,null,null,"66_56Y10M",10,"F",66,56,10]
[null,"66_56Y11M",0.627,"F",66,56,11,null,null,"66_56Y11M",10,"F",66,56,11]
[null,"66_57Y0M",0.629,"F",66,57,0,null,null,"66_57Y0M",10,"F",66,57,0]
[null,"66_57Y1M",0.63200000000000001,"F",66,57,1,null,null,"66_57Y1M",10,"F",66,57,1]
[null,"66_57Y2M",0.63500000000000001,"F",66,57,2,null,null,"66_57Y2M",10,"F",66,57,2]
[null,"66_57Y3M",0.63700000000000001,"F",66,57,3,null,null,"66_57Y3M",10,"F",66,57,3]
[null,"66_57Y4M",0.64,"F",66,57,4,null,null,"66_57Y4M",10,"F",66,57,4]
[null,"66_57Y5M",0.64200000000000002,"F",66,57,5,null,null,"66_57Y5M",10,"F",66,57,5]
[null,"66_57Y6M",0.64500000000000002,"F",66,57,6,null,null,"66_57Y6M",10,"F",66,57,6]
[null,"66_57Y7M",0.64700000000000002,"F",66,57,7,null,null,"66_57Y7M",10,"F",66,57,7]
[null,"66_57Y8M",0.65,"F",66,57,8,null,null,"66_57Y8M",10,"F",66,57,8]
[null,"66_57Y9M",0.65200000000000002,"F",66,57,9,null,null,"66_57Y9M",10,"F",66,57,9]
[null,"66_57Y10M",0.65500000000000003,"F",66,57,10,null,null,"66_57Y10M",10,"F",66,57,10]
[null,"66_57Y11M",0.65700000000000003,"F",66,57,11,null,null,"66_57Y11M",10,"F",66,57,11]
[null,"66_58Y0M",0.66,"F",66,58,0,null,null,"66_58Y0M",10,"F",66,58,0]
[null,"66_58Y1M",0.66300000000000003,"F",66,58,1,null,null,"66_58Y1M",10,"F",66,58,1]
[null,"66_58Y2M",0.66500000000000004,"F",66,58,2,null,null,"66_58Y2M",10,"F",66,58,2]
[null,"66_58Y3M",0.66800000000000004,"F",66,58,3,null,null,"66_58Y3M",10,"F",66,58,3]
[null,"66_58Y4M",0.67100000000000004,"F",66,58,4,null,null,"66_58Y4M",10,"F",66,58,4]
[null,"66_58Y5M",0.67300000000000004,"F",66,58,5,null,null,"66_58Y5M",10,"F",66,58,5]
[null,"66_58Y6M",0.67600000000000005,"F",66,58,6,null,null,"66_58Y6M",10,"F",66,58,6]
[null,"66_58Y7M",0.67900000000000005,"F",66,58,7,null,null,"66_58Y7M",10,"F",66,58,7]
[null,"66_58Y8M",0.68100000000000005,"F",66,58,8,null,null,"66_58Y8M",10,"F",66,58,8]
[null,"66_58Y9M",0.68400000000000005,"F",66,58,9,null,null,"66_58Y9M",10,"F",66,58,9]
[null,"66_58Y10M",0.68700000000000006,"F",66,58,10,null,null,"66_58Y10M",10,"F",66,58,10]
[null,"66_58Y11M",0.69,"F",66,58,11,null,null,"66_58Y11M",10,"F",66,58,11]
[null,"66_59Y0M",0.69199999999999995,"F",66,59,0,null,null,"66_59Y0M",10,"F",66,59,0]
[null,"66_59Y1M",0.69499999999999995,"F",66,59,1,null,null,"66_59Y1M",10,"F",66,59,1]
[null,"66_59Y2M",0.69799999999999995,"F",66,59,2,null,null,"66_59Y2M",10,"F",66,59,2]
[null,"66_59Y3M",0.70099999999999996,"F",66,59,3,null,null,"66_59Y3M",10,"F",66,59,3]
[null,"66_59Y4M",0.70399999999999996,"F",66,59,4,null,null,"66_59Y4M",10,"F",66,59,4]
[null,"66_59Y5M",0.70699999999999996,"F",66,59,5,null,null,"66_59Y5M",10,"F",66,59,5]
[null,"66_59Y6M",0.71,"F",66,59,6,null,null,"66_59Y6M",10,"F",66,59,6]
[null,"66_59Y7M",0.71299999999999997,"F",66,59,7,null,null,"66_59Y7M",10,"F",66,59,7]
[null,"66_59Y8M",0.71599999999999997,"F",66,59,8,null,null,"66_59Y8M",10,"F",66,59,8]
[null,"66_59Y9M",0.71799999999999997,"F",66,59,9,null,null,"66_59Y9M",10,"F",66,59,9]
[null,"66_59Y10M",0.72099999999999997,"F",66,59,10,null,null,"66_59Y10M",10,"F",66,59,10]
[null,"66_59Y11M",0.72399999999999998,"F",66,59,11,null,null,"66_59Y11M",10,"F",66,59,11]
[null,"66_60Y0M",0.72699999999999998,"F",66,60,0,null,null,"66_60Y0M",10,"F",66,60,0]
[null,"66_60Y1M",0.73,"F",66,60,1,null,null,"66_60Y1M",10,"F",66,60,1]
[null,"66_60Y2M",0.73399999999999999,"F",66,60,2,null,null,"66_60Y2M",10,"F",66,60,2]
[null,"66_60Y3M",0.73699999999999999,"F",66,60,3,null,null,"66_60Y3M",10,"F",66,60,3]
[null,"66_60Y4M",0.74,"F",66,60,4,null,null,"66_60Y4M",10,"F",66,60,4]
[null,{"$f":"E846&\"_\"&F846&\"Y\"&G846&\"M\"","v":"66_60Y5M"},0.74299999999999999,"F",66,60,5,null,null,{"$f":"M846&\"_\"&N846&\"Y\"&O846&\"M\"","v":"66_60Y5M"},10,"F",66,60,5]
[null,"66_60Y6M",0.746,"F",66,60,6,null,null,"66_60Y6M",10,"F",66,60,6]
[null,"66_60Y7M",0.749,"F",66,60,7,null,null,"66_60Y7M",10,"F",66,60,7]
[null,"66_60Y8M",0.752,"F",66,60,8,null,null,"66_60Y8M",10,"F",66,60,8]
[null,"66_60Y9M",0.755,"F",66,60,9,null,null,"66_60Y9M",10,"F",66,60,9]
[null,"66_60Y10M",0.75800000000000001,"F",66,60,10,null,null,"66_60Y10M",10,"F",66,60,10]
[null,"66_60Y11M",0.76200000000000001,"F",66,60,11,null,null,"66_60Y11M",10,"F",66,60,11]
[null,"66_61Y0M",0.76500000000000001,"F",66,61,0,null,null,"66_61Y0M",10,"F",66,61,0]
[null,"66_61Y1M",0.76800000000000002,"F",66,61,1,null,null,"66_61Y1M",10,"F",66,61,1]
[null,"66_61Y2M",0.77200000000000002,"F",66,61,2,null,null,"66_61Y2M",10,"F",66,61,2]
[null,"66_61Y3M",0.77500000000000002,"F",66,61,3,null,null,"66_61Y3M",10,"F",66,61,3]
[null,"66_61Y4M",0.77800000000000002,"F",66,61,4,null,null,"66_61Y4M",10,"F",66,61,4]
[null,"66_61Y5M",0.78200000000000003,"F",66,61,5,null,null,"66_61Y5M",10,"F",66,61,5]
[null,"66_61Y6M",0.78500000000000003,"F",66,61,6,null,null,"66_61Y6M",10,"F",66,61,6]
[null,"66_61Y7M",0.78800000000000003,"F",66,61,7,null,null,"66_61Y7M",10,"F",66,61,7]
[null,"66_61Y8M",0.79200000000000004,"F",66,61,8,null,null,"66_61Y8M",10,"F",66,61,8]
[null,"66_61Y9M",0.79500000000000004,"F",66,61,9,null,null,"66_61Y9M",10,"F",66,61,9]
[null,"66_61Y10M",0.79800000000000004,"F",66,61,10,null,null,"66_61Y10M",10,"F",66,61,10]
[null,"66_61Y11M",0.80200000000000005,"F",66,61,11,null,null,"66_61Y11M",10,"F",66,61,11]
[null,"66_62Y0M",0.80500000000000005,"F",66,62,0,null,null,"66_62Y0M",10,"F",66,62,0]
[null,"66_62Y1M",0.80900000000000005,"F",66,62,1,null,null,"66_62Y1M",10,"F",66,62,1]
[null,"66_62Y2M",0.81200000000000006,"F",66,62,2,null,null,"66_62Y2M",10,"F",66,62,2]
[null,"66_62Y3M",0.81599999999999995,"F",66,62,3,null,null,"66_62Y3M",10,"F",66,62,3]
[null,"66_62Y4M",0.82,"F",66,62,4,null,null,"66_62Y4M",10,"F",66,62,4]
[null,"66_62Y5M",0.82299999999999995,"F",66,62,5,null,null,"66_62Y5M",10,"F",66,62,5]
[null,"66_62Y6M",0.82699999999999996,"F",66,62,6,null,null,"66_62Y6M",10,"F",66,62,6]
[null,"66_62Y7M",0.83099999999999996,"F",66,62,7,null,null,"66_62Y7M",10,"F",66,62,7]
[null,"66_62Y8M",0.83399999999999996,"F",66,62,8,null,null,"66_62Y8M",10,"F",66,62,8]
[null,"66_62Y9M",0.83799999999999997,"F",66,62,9,null,null,"66_62Y9M",10,"F",66,62,9]
[null,"66_62Y10M",0.84099999999999997,"F",66,62,10,null,null,"66_62Y10M",10,"F",66,62,10]
[null,"66_62Y11M",0.84499999999999997,"F",66,62,11,null,null,"66_62Y11M",10,"F",66,62,11]
[null,"66_63Y0M",0.84899999999999998,"F",66,63,0,null,null,"66_63Y0M",10,"F",66,63,0]
[null,"66_63Y1M",0.85299999999999998,"F",66,63,1,null,null,"66_63Y1M",10,"F",66,63,1]
[null,"66_63Y2M",0.85699999999999998,"F",66,63,2,null,null,"66_63Y2M",10,"F",66,63,2]
[null,"66_63Y3M",0.86099999999999999,"F",66,63,3,null,null,"66_63Y3M",10,"F",66,63,3]
[null,"66_63Y4M",0.86399999999999999,"F",66,63,4,null,null,"66_63Y4M",10,"F",66,63,4]
[null,"66_63Y5M",0.86799999999999999,"F",66,63,5,null,null,"66_63Y5M",10,"F",66,63,5]
[null,"66_63Y6M",0.872,"F",66,63,6,null,null,"66_63Y6M",10,"F",66,63,6]
[null,"66_63Y7M",0.876,"F",66,63,7,null,null,"66_63Y7M",10,"F",66,63,7]
[null,"66_63Y8M",0.88,"F",66,63,8,null,null,"66_63Y8M",10,"F",66,63,8]
[null,"66_63Y9M",0.88400000000000001,"F",66,63,9,null,null,"66_63Y9M",10,"F",66,63,9]
[null,"66_63Y10M",0.88800000000000001,"F",66,63,10,null,null,"66_63Y10M",10,"F",66,63,10]
[null,"66_63Y11M",0.89200000000000002,"F",66,63,11,null,null,"66_63Y11M",10,"F",66,63,11]
[null,"66_64Y0M",0.89600000000000002,"F",66,64,0,null,null,"66_64Y0M",10,"F",66,64,0]
[null,"66_64Y1M",0.9,"F",66,64,1,null,null,"66_64Y1M",10,"F",66,64,1]
[null,"66_64Y2M",0.90400000000000003,"F",66,64,2,null,null,"66_64Y2M",10,"F",66,64,2]
[null,"66_64Y3M",0.90900000000000003,"F",66,64,3,null,null,"66_64Y3M",10,"F",66,64,3]
[null,"66_64Y4M",0.91300000000000003,"F",66,64,4,null,null,"66_64Y4M",10,"F",66,64,4]
[null,"66_64Y5M",0.91700000000000004,"F",66,64,5,null,null,"66_64Y5M",10,"F",66,64,5]
[null,"66_64Y6M",0.92100000000000004,"F",66,64,6,null,null,"66_64Y6M",10,"F",66,64,6]
[null,"66_64Y7M",0.92600000000000005,"F",66,64,7,null,null,"66_64Y7M",10,"F",66,64,7]
[null,"66_64Y8M",0.93,"F",66,64,8,null,null,"66_64Y8M",10,"F",66,64,8]
[null,"66_64Y9M",0.93400000000000005,"F",66,64,9,null,null,"66_64Y9M",10,"F",66,64,9]
[null,"66_64Y10M",0.93799999999999994,"F",66,64,10,null,null,"66_64Y10M",10,"F",66,64,10]
[null,"66_64Y11M",0.94299999999999995,"F",66,64,11,null,null,"66_64Y11M",10,"F",66,64,11]
[null,"66_65Y0M",0.94699999999999995,"F",66,65,0,null,null,"66_65Y0M",10,"F",66,65,0]
[null,"66_65Y1M",0.95199999999999996,"F",66,65,1,null,null,"66_65Y1M",10,"F",66,65,1]
[null,"66_65Y2M",0.95599999999999996,"F",66,65,2,null,null,"66_65Y2M",10,"F",66,65,2]
[null,"66_65Y3M",0.96099999999999997,"F",66,65,3,null,null,"66_65Y3M",10,"F",66,65,3]
[null,"66_65Y4M",0.96499999999999997,"F",66,65,4,null,null,"66_65Y4M",10,"F",66,65,4]
[null,"66_65Y5M",0.97,"F",66,65,5,null,null,"66_65Y5M",10,"F",66,65,5]
[null,"66_65Y6M",0.97499999999999998,"F",66,65,6,null,null,"66_65Y6M",10,"F",66,65,6]
[null,"66_65Y7M",0.97899999999999998,"F",66,65,7,null,null,"66_65Y7M",10,"F",66,65,7]
[null,"66_65Y8M",0.98399999999999999,"F",66,65,8,null,null,"66_65Y8M",10,"F",66,65,8]
[null,{"$f":"E910&\"_\"&F910&\"Y\"&G910&\"M\"","v":"66_65Y9M"},0.98799999999999999,"F",66,65,9,null,null,{"$f":"M910&\"_\"&N910&\"Y\"&O910&\"M\"","v":"66_65Y9M"},10,"F",66,65,9]
[null,"66_65Y10M",0.99299999999999999,"F",66,65,10,null,null,"66_65Y10M",10,"F",66,65,10]
[null,"66_65Y11M",0.995,"F",66,65,11,null,null,"66_65Y11M",10,"F",66,65,11]
[null,"66_66Y0M",1,"F",66,66,0,null,null,"66_66Y0M",10,"F",66,66,0]
[null,"66_66Y1M",1,"F",66,66,1,null,null,"66_66Y1M",10,"F",66,66,1]
[null,"66_66Y2M",1,"F",66,66,2,null,null,"66_66Y2M",10,"F",66,66,2]
[null,"66_66Y3M",1,"F",66,66,3,null,null,"66_66Y3M",10,"F",66,66,3]
[null,"66_66Y4M",1,"F",66,66,4,null,null,"66_66Y4M",10,"F",66,66,4]
[null,"66_66Y5M",1,"F",66,66,5,null,null,"66_66Y5M",10,"F",66,66,5]
[null,"66_66Y6M",1,"F",66,66,6,null,null,"66_66Y6M",10,"F",66,66,6]
[null,"66_66Y7M",1,"F",66,66,7,null,null,"66_66Y7M",10,"F",66,66,7]
[null,"66_66Y8M",1,"F",66,66,8,null,null,"66_66Y8M",10,"F",66,66,8]
[null,"66_66Y9M",1,"F",66,66,9,null,null,"66_66Y9M",10,"F",66,66,9]
[null,"66_66Y10M",1,"F",66,66,10,null,null,"66_66Y10M",10,"F",66,66,10]
[null,"66_66Y11M",1,"F",66,66,11,null,null,"66_66Y11M",10,"F",66,66,11]
[null,"66_67Y0M",1,"F",66,67,0,null,null,"66_67Y0M",10,"F",66,67,0]
[null,"66_67Y1M",1,"F",66,67,1,null,null,"66_67Y1M",10,"F",66,67,1]
[null,"66_67Y2M",1,"F",66,67,2,null,null,"66_67Y2M",10,"F",66,67,2]
[null,"66_67Y3M",1,"F",66,67,3,null,null,"66_67Y3M",10,"F",66,67,3]
[null,"66_67Y4M",1,"F",66,67,4,null,null,"66_67Y4M",10,"F",66,67,4]
[null,"66_67Y5M",1,"F",66,67,5,null,null,"66_67Y5M",10,"F",66,67,5]
[null,"66_67Y6M",1,"F",66,67,6,null,null,"66_67Y6M",10,"F",66,67,6]
[null,"66_67Y7M",1,"F",66,67,7,null,null,"66_67Y7M",10,"F",66,67,7]
[null,"66_67Y8M",1,"F",66,67,8,null,null,"66_67Y8M",10,"F",66,67,8]
[null,"66_67Y9M",1,"F",66,67,9,null,null,"66_67Y9M",10,"F",66,67,9]
[null,"66_67Y10M",1,"F",66,67,10,null,null,"66_67Y10M",10,"F",66,67,10]
[null,"66_67Y11M",1,"F",66,67,11,null,null,"66_67Y11M",10,"F",66,67,11]
[null,"66_68Y0M",1,"F",66,68,0,null,null,"66_68Y0M",10,"F",66,68,0]
[null,"66_68Y1M",1,"F",66,68,1,null,null,"66_68Y1M",10,"F",66,68,1]
[null,"66_68Y2M",1,"F",66,68,2,null,null,"66_68Y2M",10,"F",66,68,2]
[null,"66_68Y3M",1,"F",66,68,3,null,null,"66_68Y3M",10,"F",66,68,3]
[null,"66_68Y4M",1,"F",66,68,4,null,null,"66_68Y4M",10,"F",66,68,4]
[null,"66_68Y5M",1,"F",66,68,5,null,null,"66_68Y5M",10,"F",66,68,5]
[null,"66_68Y6M",1,"F",66,68,6,null,null,"66_68Y6M",10,"F",66,68,6]
[null,"66_68Y7M",1,"F",66,68,7,null,null,"66_68Y7M",10,"F",66,68,7]
[null,"66_68Y8M",1,"F",66,68,8,null,null,"66_68Y8M",10,"F",66,68,8]
[null,"66_68Y9M",1,"F",66,68,9,null,null,"66_68Y9M",10,"F",66,68,9]
[null,"66_68Y10M",1,"F",66,68,10,null,null,"66_68Y10M",10,"F",66,68,10]
[null,"66_68Y11M",1,"F",66,68,11,null,null,"66_68Y11M",10,"F",66,68,11]
[null,"66_69Y0M",1,"F",66,69,0,null,null,"66_69Y0M",10,"F",66,69,0]
[null,"66_69Y1M",1,"F",66,69,1,null,null,"66_69Y1M",10,"F",66,69,1]
[null,"66_69Y2M",1,"F",66,69,2,null,null,"66_69Y2M",10,"F",66,69,2]
[null,"66_69Y3M",1,"F",66,69,3,null,null,"66_69Y3M",10,"F",66,69,3]
[null,"66_69Y4M",1,"F",66,69,4,null,null,"66_69Y4M",10,"F",66,69,4]
[null,"66_69Y5M",1,"F",66,69,5,null,null,"66_69Y5M",10,"F",66,69,5]
[null,"66_69Y6M",1,"F",66,69,6,null,null,"66_69Y6M",10,"F",66,69,6]
[null,"66_69Y7M",1,"F",66,69,7,null,null,"66_69Y7M",10,"F",66,69,7]
[null,"66_69Y8M",1,"F",66,69,8,null,null,"66_69Y8M",10,"F",66,69,8]
[null,"66_69Y9M",1,"F",66,69,9,null,null,"66_69Y9M",10,"F",66,69,9]
[null,"66_69Y10M",1,"F",66,69,10,null,null,"66_69Y10M",10,"F",66,69,10]
[null,"66_69Y11M",1,"F",66,69,11,null,null,"66_69Y11M",10,"F",66,69,11]
[null,"66_70Y0M",1,"F",66,70,0,null,null,"66_70Y0M",10,"F",66,70,0]
[null,"66_70Y1M",1,"F",66,70,1,null,null,"66_70Y1M",10,"F",66,70,1]
[null,"66_70Y2M",1,"F",66,70,2,null,null,"66_70Y2M",10,"F",66,70,2]
[null,"66_70Y3M",1,"F",66,70,3,null,null,"66_70Y3M",10,"F",66,70,3]
[null,"66_70Y4M",1,"F",66,70,4,null,null,"66_70Y4M",10,"F",66,70,4]
[null,"66_70Y5M",1,"F",66,70,5,null,null,"66_70Y5M",10,"F",66,70,5]
[null,"66_70Y6M",1,"F",66,70,6,null,null,"66_70Y6M",10,"F",66,70,6]
[null,"66_70Y7M",1,"F",66,70,7,null,null,"66_70Y7M",10,"F",66,70,7]
[null,"66_70Y8M",1,"F",66,70,8,null,null,"66_70Y8M",10,"F",66,70,8]
[null,"66_70Y9M",1,"F",66,70,9,null,null,"66_70Y9M",10,"F",66,70,9]
[null,"66_70Y10M",1,"F",66,70,10,null,null,"66_70Y10M",10,"F",66,70,10]
[null,"66_70Y11M",1,"F",66,70,11,null,null,"66_70Y11M",10,"F",66,70,11]
[null,"66_71Y0M",1,"F",66,71,0,null,null,"66_71Y0M",10,"F",66,71,0]
[null,{"$f":"E974&\"_\"&F974&\"Y\"&G974&\"M\"","v":"66_71Y1M"},1,"F",66,71,1,null,null,{"$f":"M974&\"_\"&N974&\"Y\"&O974&\"M\"","v":"66_71Y1M"},10,"F",66,71,1]
[null,"66_71Y2M",1,"F",66,71,2,null,null,"66_71Y2M",10,"F",66,71,2]
[null,"66_71Y3M",1,"F",66,71,3,null,null,"66_71Y3M",10,"F",66,71,3]
[null,"66_71Y4M",1,"F",66,71,4,null,null,"66_71Y4M",10,"F",66,71,4]
[null,"66_71Y5M",1,"F",66,71,5,null,null,"66_71Y5M",10,"F",66,71,5]
[null,"66_71Y6M",1,"F",66,71,6,null,null,"66_71Y6M",10,"F",66,71,6]
[null,"66_71Y7M",1,"F",66,71,7,null,null,"66_71Y7M",10,"F",66,71,7]
[null,"66_71Y8M",1,"F",66,71,8,null,null,"66_71Y8M",10,"F",66,71,8]
[null,"66_71Y9M",1,"F",66,71,9,null,null,"66_71Y9M",10,"F",66,71,9]
[null,"66_71Y10M",1,"F",66,71,10,null,null,"66_71Y10M",10,"F",66,71,10]
[null,"66_71Y11M",1,"F",66,71,11,null,null,"66_71Y11M",10,"F",66,71,11]
[null,"66_72Y0M",1,"F",66,72,0,null,null,"66_72Y0M",10,"F",66,72,0]
[null,"66_72Y1M",1,"F",66,72,1,null,null,"66_72Y1M",10,"F",66,72,1]
[null,"66_72Y2M",1,"F",66,72,2,null,null,"66_72Y2M",10,"F",66,72,2]
[null,"66_72Y3M",1,"F",66,72,3,null,null,"66_72Y3M",10,"F",66,72,3]
[null,"66_72Y4M",1,"F",66,72,4,null,null,"66_72Y4M",10,"F",66,72,4]
[null,"66_72Y5M",1,"F",66,72,5,null,null,"66_72Y5M",10,"F",66,72,5]
[null,"66_72Y6M",1,"F",66,72,6,null,null,"66_72Y6M",10,"F",66,72,6]
[null,"66_72Y7M",1,"F",66,72,7,null,null,"66_72Y7M",10,"F",66,72,7]
[null,"66_72Y8M",1,"F",66,72,8,null,null,"66_72Y8M",10,"F",66,72,8]
[null,"66_72Y9M",1,"F",66,72,9,null,null,"66_72Y9M",10,"F",66,72,9]
[null,"66_72Y10M",1,"F",66,72,10,null,null,"66_72Y10M",10,"F",66,72,10]
[null,"66_72Y11M",1,"F",66,72,11,null,null,"66_72Y11M",10,"F",66,72,11]
[null,"66_73Y0M",1,"F",66,73,0,null,null,"66_73Y0M",10,"F",66,73,0]
[null,"66_73Y1M",1,"F",66,73,1,null,null,"66_73Y1M",10,"F",66,73,1]
[null,"66_73Y2M",1,"F",66,73,2,null,null,"66_73Y2M",10,"F",66,73,2]
[null,"66_73Y3M",1,"F",66,73,3,null,null,"66_73Y3M",10,"F",66,73,3]
[null,"66_73Y4M",1,"F",66,73,4,null,null,"66_73Y4M",10,"F",66,73,4]
[null,"66_73Y5M",1,"F",66,73,5,null,null,"66_73Y5M",10,"F",66,73,5]
[null,"66_73Y6M",1,"F",66,73,6,null,null,"66_73Y6M",10,"F",66,73,6]
[null,"66_73Y7M",1,"F",66,73,7,null,null,"66_73Y7M",10,"F",66,73,7]
[null,"66_73Y8M",1,"F",66,73,8,null,null,"66_73Y8M",10,"F",66,73,8]
[null,"66_73Y9M",1,"F",66,73,9,null,null,"66_73Y9M",10,"F",66,73,9]
[null,"66_73Y10M",1,"F",66,73,10,null,null,"66_73Y10M",10,"F",66,73,10]
[null,"66_73Y11M",1,"F",66,73,11,null,null,"66_73Y11M",10,"F",66,73,11]
[null,"66_74Y0M",1,"F",66,74,0,null,null,"66_74Y0M",10,"F",66,74,0]
[null,"66_74Y1M",1,"F",66,74,1,null,null,"66_74Y1M",10,"F",66,74,1]
[null,"66_74Y2M",1,"F",66,74,2,null,null,"66_74Y2M",10,"F",66,74,2]
[null,"66_74Y3M",1,"F",66,74,3,null,null,"66_74Y3M",10,"F",66,74,3]
[null,"66_74Y4M",1,"F",66,74,4,null,null,"66_74Y4M",10,"F",66,74,4]
[null,"66_74Y5M",1,"F",66,74,5,null,null,"66_74Y5M",10,"F",66,74,5]
[null,"66_74Y6M",1,"F",66,74,6,null,null,"66_74Y6M",10,"F",66,74,6]
[null,"66_74Y7M",1,"F",66,74,7,null,null,"66_74Y7M",10,"F",66,74,7]
[null,"66_74Y8M",1,"F",66,74,8,null,null,"66_74Y8M",10,"F",66,74,8]
[null,"66_74Y9M",1,"F",66,74,9,null,null,"66_74Y9M",10,"F",66,74,9]
[null,"66_74Y10M",1,"F",66,74,10,null,null,"66_74Y10M",10,"F",66,74,10]
[null,"66_74Y11M",1,"F",66,74,11,null,null,"66_74Y11M",10,"F",66,74,11]
[null,{"$f":"E1021&\"_\"&F1021&\"Y\"&G1021&\"M\"","v":"67_54Y0M"},0.52,"M",67,54,0,null,null,"67_54Y0M",10,"M",67,54,0]
[null,"67_54Y1M",0.52200000000000002,"M",67,54,1,null,null,"67_54Y1M",10,"M",67,54,1]
[null,"67_54Y2M",0.52400000000000002,"M",67,54,2,null,null,"67_54Y2M",10,"M",67,54,2]
[null,"67_54Y3M",0.52500000000000002,"M",67,54,3,null,null,"67_54Y3M",10,"M",67,54,3]
[null,"67_54Y4M",0.52700000000000002,"M",67,54,4,null,null,"67_54Y4M",10,"M",67,54,4]
[null,"67_54Y5M",0.52900000000000003,"M",67,54,5,null,null,"67_54Y5M",10,"M",67,54,5]
[null,"67_54Y6M",0.53100000000000003,"M",67,54,6,null,null,"67_54Y6M",10,"M",67,54,6]
[null,"67_54Y7M",0.53300000000000003,"M",67,54,7,null,null,"67_54Y7M",10,"M",67,54,7]
[null,"67_54Y8M",0.53500000000000003,"M",67,54,8,null,null,"67_54Y8M",10,"M",67,54,8]
[null,"67_54Y9M",0.53700000000000003,"M",67,54,9,null,null,"67_54Y9M",10,"M",67,54,9]
[null,"67_54Y10M",0.53900000000000003,"M",67,54,10,null,null,"67_54Y10M",10,"M",67,54,10]
[null,"67_54Y11M",0.54100000000000004,"M",67,54,11,null,null,"67_54Y11M",10,"M",67,54,11]
[null,"67_55Y0M",0.54300000000000004,"M",67,55,0,null,null,"67_55Y0M",10,"M",67,55,0]
[null,"67_55Y1M",0.54500000000000004,"M",67,55,1,null,null,"67_55Y1M",10,"M",67,55,1]
[null,"67_55Y2M",0.54700000000000004,"M",67,55,2,null,null,"67_55Y2M",10,"M",67,55,2]
[null,"67_55Y3M",0.54900000000000004,"M",67,55,3,null,null,"67_55Y3M",10,"M",67,55,3]
[null,"67_55Y4M",0.55100000000000005,"M",67,55,4,null,null,"67_55Y4M",10,"M",67,55,4]
[null,"67_55Y5M",0.55400000000000005,"M",67,55,5,null,null,{"$f":"M1038&\"_\"&N1038&\"Y\"&O1038&\"M\"","v":"67_55Y5M"},10,"M",67,55,5]
[null,"67_55Y6M",0.55600000000000005,"M",67,55,6,null,null,"67_55Y6M",10,"M",67,55,6]
[null,"67_55Y7M",0.55800000000000005,"M",67,55,7,null,null,"67_55Y7M",10,"M",67,55,7]
[null,"67_55Y8M",0.56000000000000005,"M",67,55,8,null,null,"67_55Y8M",10,"M",67,55,8]
[null,"67_55Y9M",0.56200000000000006,"M",67,55,9,null,null,"67_55Y9M",10,"M",67,55,9]
[null,"67_55Y10M",0.56399999999999995,"M",67,55,10,null,null,"67_55Y10M",10,"M",67,55,10]
[null,"67_55Y11M",0.56599999999999995,"M",67,55,11,null,null,"67_55Y11M",10,"M",67,55,11]
[null,"67_56Y0M",0.56799999999999995,"M",67,56,0,null,null,"67_56Y0M",10,"M",67,56,0]
[null,"67_56Y1M",0.56999999999999995,"M",67,56,1,null,null,"67_56Y1M",10,"M",67,56,1]
[null,"67_56Y2M",0.57299999999999995,"M",67,56,2,null,null,"67_56Y2M",10,"M",67,56,2]
[null,"67_56Y3M",0.57499999999999996,"M",67,56,3,null,null,"67_56Y3M",10,"M",67,56,3]
[null,"67_56Y4M",0.57699999999999996,"M",67,56,4,null,null,"67_56Y4M",10,"M",67,56,4]
[null,"67_56Y5M",0.57899999999999996,"M",67,56,5,null,null,"67_56Y5M",10,"M",67,56,5]
[null,"67_56Y6M",0.58199999999999996,"M",67,56,6,null,null,"67_56Y6M",10,"M",67,56,6]
[null,"67_56Y7M",0.58399999999999996,"M",67,56,7,null,null,"67_56Y7M",10,"M",67,56,7]
[null,"67_56Y8M",0.58599999999999997,"M",67,56,8,null,null,"67_56Y8M",10,"M",67,56,8]
[null,"67_56Y9M",0.58799999999999997,"M",67,56,9,null,null,"67_56Y9M",10,"M",67,56,9]
[null,"67_56Y10M",0.59,"M",67,56,10,null,null,"67_56Y10M",10,"M",67,56,10]
[null,"67_56Y11M",0.59299999999999997,"M",67,56,11,null,null,"67_56Y11M",10,"M",67,56,11]
[null,"67_57Y0M",0.59499999999999997,"M",67,57,0,null,null,"67_57Y0M",10,"M",67,57,0]
[null,"67_57Y1M",0.59699999999999998,"M",67,57,1,null,null,"67_57Y1M",10,"M",67,57,1]
[null,"67_57Y2M",0.6,"M",67,57,2,null,null,"67_57Y2M",10,"M",67,57,2]
[null,"67_57Y3M",0.60199999999999998,"M",67,57,3,null,null,"67_57Y3M",10,"M",67,57,3]
[null,"67_57Y4M",0.60499999999999998,"M",67,57,4,null,null,"67_57Y4M",10,"M",67,57,4]
[null,"67_57Y5M",0.60699999999999998,"M",67,57,5,null,null,"67_57Y5M",10,"M",67,57,5]
[null,"67_57Y6M",0.60899999999999999,"M",67,57,6,null,null,"67_57Y6M",10,"M",67,57,6]
[null,"67_57Y7M",0.61199999999999999,"M",67,57,7,null,null,"67_57Y7M",10,"M",67,57,7]
[null,"67_57Y8M",0.61399999999999999,"M",67,57,8,null,null,"67_57Y8M",10,"M",67,57,8]
[null,"67_57Y9M",0.61599999999999999,"M",67,57,9,null,null,"67_57Y9M",10,"M",67,57,9]
[null,"67_57Y10M",0.61899999999999999,"M",67,57,10,null,null,"67_57Y10M",10,"M",67,57,10]
[null,"67_57Y11M",0.621,"M",67,57,11,null,null,"67_57Y11M",10,"M",67,57,11]
[null,"67_58Y0M",0.624,"M",67,58,0,null,null,"67_58Y0M",10,"M",67,58,0]
[null,{"$f":"E1070&\"_\"&F1070&\"Y\"&G1070&\"M\"","v":"67_58Y1M"},0.626,"M",67,58,1,null,null,"67_58Y1M",10,"M",67,58,1]
[null,"67_58Y2M",0.629,"M",67,58,2,null,null,"67_58Y2M",10,"M",67,58,2]
[null,"67_58Y3M",0.63100000000000001,"M",67,58,3,null,null,"67_58Y3M",10,"M",67,58,3]
[null,"67_58Y4M",0.63400000000000001,"M",67,58,4,null,null,"67_58Y4M",10,"M",67,58,4]
[null,"67_58Y5M",0.63600000000000001,"M",67,58,5,null,null,"67_58Y5M",10,"M",67,58,5]
[null,"67_58Y6M",0.63900000000000001,"M",67,58,6,null,null,"67_58Y6M",10,"M",67,58,6]
[null,"67_58Y7M",0.64100000000000001,"M",67,58,7,null,null,"67_58Y7M",10,"M",67,58,7]
[null,"67_58Y8M",0.64400000000000002,"M",67,58,8,null,null,"67_58Y8M",10,"M",67,58,8]
[null,"67_58Y9M",0.64700000000000002,"M",67,58,9,null,null,"67_58Y9M",10,"M",67,58,9]
[null,"67_58Y10M",0.64900000000000002,"M",67,58,10,null,null,"67_58Y10M",10,"M",67,58,10]
[null,"67_58Y11M",0.65200000000000002,"M",67,58,11,null,null,"67_58Y11M",10,"M",67,58,11]
[null,"67_59Y0M",0.65400000000000003,"M",67,59,0,null,null,"67_59Y0M",10,"M",67,59,0]
[null,"67_59Y1M",0.65700000000000003,"M",67,59,1,null,null,"67_59Y1M",10,"M",67,59,1]
[null,"67_59Y2M",0.66,"M",67,59,2,null,null,"67_59Y2M",10,"M",67,59,2]
[null,"67_59Y3M",0.66200000000000003,"M",67,59,3,null,null,"67_59Y3M",10,"M",67,59,3]
[null,"67_59Y4M",0.66500000000000004,"M",67,59,4,null,null,"67_59Y4M",10,"M",67,59,4]
[null,"67_59Y5M",0.66800000000000004,"M",67,59,5,null,null,"67_59Y5M",10,"M",67,59,5]
[null,"67_59Y6M",0.67100000000000004,"M",67,59,6,null,null,"67_59Y6M",10,"M",67,59,6]
[null,"67_59Y7M",0.67300000000000004,"M",67,59,7,null,null,"67_59Y7M",10,"M",67,59,7]
[null,"67_59Y8M",0.67600000000000005,"M",67,59,8,null,null,"67_59Y8M",10,"M",67,59,8]
[null,"67_59Y9M",0.67900000000000005,"M",67,59,9,null,null,"67_59Y9M",10,"M",67,59,9]
[null,"67_59Y10M",0.68200000000000005,"M",67,59,10,null,null,"67_59Y10M",10,"M",67,59,10]
[null,"67_59Y11M",0.68400000000000005,"M",67,59,11,null,null,"67_59Y11M",10,"M",67,59,11]
[null,"67_60Y0M",0.68700000000000006,"M",67,60,0,null,null,"67_60Y0M",10,"M",67,60,0]
[null,"67_60Y1M",0.69,"M",67,60,1,null,null,"67_60Y1M",10,"M",67,60,1]
[null,"67_60Y2M",0.69299999999999995,"M",67,60,2,null,null,"67_60Y2M",10,"M",67,60,2]
[null,"67_60Y3M",0.69599999999999995,"M",67,60,3,null,null,"67_60Y3M",10,"M",67,60,3]
[null,"67_60Y4M",0.69899999999999995,"M",67,60,4,null,null,"67_60Y4M",10,"M",67,60,4]
[null,"67_60Y5M",0.70199999999999996,"M",67,60,5,null,null,"67_60Y5M",10,"M",67,60,5]
[null,"67_60Y6M",0.70499999999999996,"M",67,60,6,null,null,"67_60Y6M",10,"M",67,60,6]
[null,"67_60Y7M",0.70799999999999996,"M",67,60,7,null,null,"67_60Y7M",10,"M",67,60,7]
[null,"67_60Y8M",0.71099999999999997,"M",67,60,8,null,null,"67_60Y8M",10,"M",67,60,8]
[null,"67_60Y9M",0.71299999999999997,"M",67,60,9,null,null,{"$f":"M1102&\"_\"&N1102&\"Y\"&O1102&\"M\"","v":"67_60Y9M"},10,"M",67,60,9]
[null,"67_60Y10M",0.71599999999999997,"M",67,60,10,null,null,"67_60Y10M",10,"M",67,60,10]
[null,"67_60Y11M",0.71899999999999997,"M",67,60,11,null,null,"67_60Y11M",10,"M",67,60,11]
[null,"67_61Y0M",0.72199999999999998,"M",67,61,0,null,null,"67_61Y0M",10,"M",67,61,0]
[null,"67_61Y1M",0.72599999999999998,"M",67,61,1,null,null,"67_61Y1M",10,"M",67,61,1]
[null,"67_61Y2M",0.72899999999999998,"M",67,61,2,null,null,"67_61Y2M",10,"M",67,61,2]
[null,"67_61Y3M",0.73199999999999998,"M",67,61,3,null,null,"67_61Y3M",10,"M",67,61,3]
[null,"67_61Y4M",0.73499999999999999,"M",67,61,4,null,null,"67_61Y4M",10,"M",67,61,4]
[null,"67_61Y5M",0.73799999999999999,"M",67,61,5,null,null,"67_61Y5M",10,"M",67,61,5]
[null,"67_61Y6M",0.74099999999999999,"M",67,61,6,null,null,"67_61Y6M",10,"M",67,61,6]
[null,"67_61Y7M",0.74399999999999999,"M",67,61,7,null,null,"67_61Y7M",10,"M",67,61,7]
[null,"67_61Y8M",0.748,"M",67,61,8,null,null,"67_61Y8M",10,"M",67,61,8]
[null,"67_61Y9M",0.751,"M",67,61,9,null,null,"67_61Y9M",10,"M",67,61,9]
[null,"67_61Y10M",0.754,"M",67,61,10,null,null,"67_61Y10M",10,"M",67,61,10]
[null,"67_61Y11M",0.75700000000000001,"M",67,61,11,null,null,"67_61Y11M",10,"M",67,61,11]
[null,"67_62Y0M",0.76,"M",67,62,0,null,null,"67_62Y0M",10,"M",67,62,0]
[null,"67_62Y1M",0.76400000000000001,"M",67,62,1,null,null,"67_62Y1M",10,"M",67,62,1]
[null,"67_62Y2M",0.76700000000000002,"M",67,62,2,null,null,"67_62Y2M",10,"M",67,62,2]
[null,"67_62Y3M",0.77100000000000002,"M",67,62,3,null,null,"67_62Y3M",10,"M",67,62,3]
[null,"67_62Y4M",0.77400000000000002,"M",67,62,4,null,null,"67_62Y4M",10,"M",67,62,4]
[null,"67_62Y5M",0.77700000000000002,"M",67,62,5,null,null,"67_62Y5M",10,"M",67,62,5]
[null,"67_62Y6M",0.78100000000000003,"M",67,62,6,null,null,"67_62Y6M",10,"M",67,62,6]
[null,"67_62Y7M",0.78400000000000003,"M",67,62,7,null,null,"67_62Y7M",10,"M",67,62,7]
[null,"67_62Y8M",0.78800000000000003,"M",67,62,8,null,null,"67_62Y8M",10,"M",67,62,8]
[null,"67_62Y9M",0.79100000000000004,"M",67,62,9,null,null,"67_62Y9M",10,"M",67,62,9]
[null,"67_62Y10M",0.79400000000000004,"M",67,62,10,null,null,"67_62Y10M",10,"M",67,62,10]
[null,"67_62Y11M",0.79800000000000004,"M",67,62,11,null,null,"67_62Y11M",10,"M",67,62,11]
[null,"67_63Y0M",0.80100000000000005,"M",67,63,0,null,null,"67_63Y0M",10,"M",67,63,0]
[null,"67_63Y1M",0.80500000000000005,"M",67,63,1,null,null,"67_63Y1M",10,"M",67,63,1]
[null,"67_63Y2M",0.80900000000000005,"M",67,63,2,null,null,"67_63Y2M",10,"M",67,63,2]
[null,"67_63Y3M",0.81200000000000006,"M",67,63,3,null,null,"67_63Y3M",10,"M",67,63,3]
[null,"67_63Y4M",0.81599999999999995,"M",67,63,4,null,null,"67_63Y4M",10,"M",67,63,4]
[null,{"$f":"E1134&\"_\"&F1134&\"Y\"&G1134&\"M\"","v":"67_63Y5M"},0.82,"M",67,63,5,null,null,"67_63Y5M",10,"M",67,63,5]
[null,"67_63Y6M",0.82299999999999995,"M",67,63,6,null,null,"67_63Y6M",10,"M",67,63,6]
[null,"67_63Y7M",0.82699999999999996,"M",67,63,7,null,null,"67_63Y7M",10,"M",67,63,7]
[null,"67_63Y8M",0.83099999999999996,"M",67,63,8,null,null,"67_63Y8M",10,"M",67,63,8]
[null,"67_63Y9M",0.83399999999999996,"M",67,63,9,null,null,"67_63Y9M",10,"M",67,63,9]
[null,"67_63Y10M",0.83799999999999997,"M",67,63,10,null,null,"67_63Y10M",10,"M",67,63,10]
[null,"67_63Y11M",0.84199999999999997,"M",67,63,11,null,null,"67_63Y11M",10,"M",67,63,11]
[null,"67_64Y0M",0.84599999999999997,"M",67,64,0,null,null,"67_64Y0M",10,"M",67,64,0]
[null,"67_64Y1M",0.85,"M",67,64,1,null,null,"67_64Y1M",10,"M",67,64,1]
[null,"67_64Y2M",0.85399999999999998,"M",67,64,2,null,null,"67_64Y2M",10,"M",67,64,2]
[null,"67_64Y3M",0.85799999999999998,"M",67,64,3,null,null,"67_64Y3M",10,"M",67,64,3]
[null,"67_64Y4M",0.86199999999999999,"M",67,64,4,null,null,"67_64Y4M",10,"M",67,64,4]
[null,"67_64Y5M",0.86599999999999999,"M",67,64,5,null,null,"67_64Y5M",10,"M",67,64,5]
[null,"67_64Y6M",0.87,"M",67,64,6,null,null,"67_64Y6M",10,"M",67,64,6]
[null,"67_64Y7M",0.874,"M",67,64,7,null,null,"67_64Y7M",10,"M",67,64,7]
[null,"67_64Y8M",0.878,"M",67,64,8,null,null,"67_64Y8M",10,"M",67,64,8]
[null,"67_64Y9M",0.88200000000000001,"M",67,64,9,null,null,"67_64Y9M",10,"M",67,64,9]
[null,"67_64Y10M",0.88600000000000001,"M",67,64,10,null,null,"67_64Y10M",10,"M",67,64,10]
[null,"67_64Y11M",0.89,"M",67,64,11,null,null,"67_64Y11M",10,"M",67,64,11]
[null,"67_65Y0M",0.89400000000000002,"M",67,65,0,null,null,"67_65Y0M",10,"M",67,65,0]
[null,"67_65Y1M",0.89800000000000002,"M",67,65,1,null,null,"67_65Y1M",10,"M",67,65,1]
[null,"67_65Y2M",0.90200000000000002,"M",67,65,2,null,null,"67_65Y2M",10,"M",67,65,2]
[null,"67_65Y3M",0.90700000000000003,"M",67,65,3,null,null,"67_65Y3M",10,"M",67,65,3]
[null,"67_65Y4M",0.91100000000000003,"M",67,65,4,null,null,"67_65Y4M",10,"M",67,65,4]
[null,"67_65Y5M",0.91500000000000004,"M",67,65,5,null,null,"67_65Y5M",10,"M",67,65,5]
[null,"67_65Y6M",0.92,"M",67,65,6,null,null,"67_65Y6M",10,"M",67,65,6]
[null,"67_65Y7M",0.92400000000000004,"M",67,65,7,null,null,"67_65Y7M",10,"M",67,65,7]
[null,"67_65Y8M",0.92800000000000005,"M",67,65,8,null,null,"67_65Y8M",10,"M",67,65,8]
[null,"67_65Y9M",0.93300000000000005,"M",67,65,9,null,null,"67_65Y9M",10,"M",67,65,9]
[null,"67_65Y10M",0.93700000000000006,"M",67,65,10,null,null,"67_65Y10M",10,"M",67,65,10]
[null,"67_65Y11M",0.94099999999999995,"M",67,65,11,null,null,"67_65Y11M",10,"M",67,65,11]
[null,"67_66Y0M",0.94599999999999995,"M",67,66,0,null,null,"67_66Y0M",10,"M",67,66,0]
[null,"67_66Y1M",0.95099999999999996,"M",67,66,1,null,null,{"$f":"M1166&\"_\"&N1166&\"Y\"&O1166&\"M\"","v":"67_66Y1M"},10,"M",67,66,1]
[null,"67_66Y2M",0.95499999999999996,"M",67,66,2,null,null,"67_66Y2M",10,"M",67,66,2]
[null,"67_66Y3M",0.96,"M",67,66,3,null,null,"67_66Y3M",10,"M",67,66,3]
[null,"67_66Y4M",0.96499999999999997,"M",67,66,4,null,null,"67_66Y4M",10,"M",67,66,4]
[null,"67_66Y5M",0.96899999999999997,"M",67,66,5,null,null,"67_66Y5M",10,"M",67,66,5]
[null,"67_66Y6M",0.97399999999999998,"M",67,66,6,null,null,"67_66Y6M",10,"M",67,66,6]
[null,"67_66Y7M",0.97899999999999998,"M",67,66,7,null,null,"67_66Y7M",10,"M",67,66,7]
[null,"67_66Y8M",0.98399999999999999,"M",67,66,8,null,null,"67_66Y8M",10,"M",67,66,8]
[null,"67_66Y9M",0.98799999999999999,"M",67,66,9,null,null,"67_66Y9M",10,"M",67,66,9]
[null,"67_66Y10M",0.99299999999999999,"M",67,66,10,null,null,"67_66Y10M",10,"M",67,66,10]
[null,"67_66Y11M",0.995,"M",67,66,11,null,null,"67_66Y11M",10,"M",67,66,11]
[null,"67_67Y0M",1,"M",67,67,0,null,null,"67_67Y0M",10,"M",67,67,0]
[null,"67_67Y1M",1,"M",67,67,1,null,null,"67_67Y1M",10,"M",67,67,1]
[null,"67_67Y2M",1,"M",67,67,2,null,null,"67_67Y2M",10,"M",67,67,2]
[null,"67_67Y3M",1,"M",67,67,3,null,null,"67_67Y3M",10,"M",67,67,3]
[null,"67_67Y4M",1,"M",67,67,4,null,null,"67_67Y4M",10,"M",67,67,4]
[null,"67_67Y5M",1,"M",67,67,5,null,null,"67_67Y5M",10,"M",67,67,5]
[null,"67_67Y6M",1,"M",67,67,6,null,null,"67_67Y6M",10,"M",67,67,6]
[null,"67_67Y7M",1,"M",67,67,7,null,null,"67_67Y7M",10,"M",67,67,7]
[null,"67_67Y8M",1,"M",67,67,8,null,null,"67_67Y8M",10,"M",67,67,8]
[null,"67_67Y9M",1,"M",67,67,9,null,null,"67_67Y9M",10,"M",67,67,9]
[null,"67_67Y10M",1,"M",67,67,10,null,null,"67_67Y10M",10,"M",67,67,10]
[null,"67_67Y11M",1,"M",67,67,11,null,null,"67_67Y11M",10,"M",67,67,11]
[null,"67_68Y0M",1,"M",67,68,0,null,null,"67_68Y0M",10,"M",67,68,0]
[null,"67_68Y1M",1,"M",67,68,1,null,null,"67_68Y1M",10,"M",67,68,1]
[null,"67_68Y2M",1,"M",67,68,2,null,null,"67_68Y2M",10,"M",67,68,2]
[null,"67_68Y3M",1,"M",67,68,3,null,null,"67_68Y3M",10,"M",67,68,3]
[null,"67_68Y4M",1,"M",67,68,4,null,null,"67_68Y4M",10,"M",67,68,4]
[null,"67_68Y5M",1,"M",67,68,5,null,null,"67_68Y5M",10,"M",67,68,5]
[null,"67_68Y6M",1,"M",67,68,6,null,null,"67_68Y6M",10,"M",67,68,6]
[null,"67_68Y7M",1,"M",67,68,7,null,null,"67_68Y7M",10,"M",67,68,7]
[null,"67_68Y8M",1,"M",67,68,8,null,null,"67_68Y8M",10,"M",67,68,8]
[null,{"$f":"E1198&\"_\"&F1198&\"Y\"&G1198&\"M\"","v":"67_68Y9M"},1,"M",67,68,9,null,null,"67_68Y9M",10,"M",67,68,9]
[null,"67_68Y10M",1,"M",67,68,10,null,null,"67_68Y10M",10,"M",67,68,10]
[null,"67_68Y11M",1,"M",67,68,11,null,null,"67_68Y11M",10,"M",67,68,11]
[null,"67_69Y0M",1,"M",67,69,0,null,null,"67_69Y0M",10,"M",67,69,0]
[null,"67_69Y1M",1,"M",67,69,1,null,null,"67_69Y1M",10,"M",67,69,1]
[null,"67_69Y2M",1,"M",67,69,2,null,null,"67_69Y2M",10,"M",67,69,2]
[null,"67_69Y3M",1,"M",67,69,3,null,null,"67_69Y3M",10,"M",67,69,3]
[null,"67_69Y4M",1,"M",67,69,4,null,null,"67_69Y4M",10,"M",67,69,4]
[null,"67_69Y5M",1,"M",67,69,5,null,null,"67_69Y5M",10,"M",67,69,5]
[null,"67_69Y6M",1,"M",67,69,6,null,null,"67_69Y6M",10,"M",67,69,6]
[null,"67_69Y7M",1,"M",67,69,7,null,null,"67_69Y7M",10,"M",67,69,7]
[null,"67_69Y8M",1,"M",67,69,8,null,null,"67_69Y8M",10,"M",67,69,8]
[null,"67_69Y9M",1,"M",67,69,9,null,null,"67_69Y9M",10,"M",67,69,9]
[null,"67_69Y10M",1,"M",67,69,10,null,null,"67_69Y10M",10,"M",67,69,10]
[null,"67_69Y11M",1,"M",67,69,11,null,null,"67_69Y11M",10,"M",67,69,11]
[null,"67_70Y0M",1,"M",67,70,0,null,null,"67_70Y0M",10,"M",67,70,0]
[null,"67_70Y1M",1,"M",67,70,1,null,null,"67_70Y1M",10,"M",67,70,1]
[null,"67_70Y2M",1,"M",67,70,2,null,null,"67_70Y2M",10,"M",67,70,2]
[null,"67_70Y3M",1,"M",67,70,3,null,null,"67_70Y3M",10,"M",67,70,3]
[null,"67_70Y4M",1,"M",67,70,4,null,null,"67_70Y4M",10,"M",67,70,4]
[null,"67_70Y5M",1,"M",67,70,5,null,null,"67_70Y5M",10,"M",67,70,5]
[null,"67_70Y6M",1,"M",67,70,6,null,null,"67_70Y6M",10,"M",67,70,6]
[null,"67_70Y7M",1,"M",67,70,7,null,null,"67_70Y7M",10,"M",67,70,7]
[null,"67_70Y8M",1,"M",67,70,8,null,null,"67_70Y8M",10,"M",67,70,8]
[null,"67_70Y9M",1,"M",67,70,9,null,null,"67_70Y9M",10,"M",67,70,9]
[null,"67_70Y10M",1,"M",67,70,10,null,null,"67_70Y10M",10,"M",67,70,10]
[null,"67_70Y11M",1,"M",67,70,11,null,null,"67_70Y11M",10,"M",67,70,11]
[null,"67_71Y0M",1,"M",67,71,0,null,null,"67_71Y0M",10,"M",67,71,0]
[null,"67_71Y1M",1,"M",67,71,1,null,null,"67_71Y1M",10,"M",67,71,1]
[null,"67_71Y2M",1,"M",67,71,2,null,null,"67_71Y2M",10,"M",67,71,2]
[null,"67_71Y3M",1,"M",67,71,3,null,null,"67_71Y3M",10,"M",67,71,3]
[null,"67_71Y4M",1,"M",67,71,4,null,null,"67_71Y4M",10,"M",67,71,4]
[null,"67_71Y5M",1,"M",67,71,5,null,null,{"$f":"M1230&\"_\"&N1230&\"Y\"&O1230&\"M\"","v":"67_71Y5M"},10,"M",67,71,5]
[null,"67_71Y6M",1,"M",67,71,6,null,null,"67_71Y6M",10,"M",67,71,6]
[null,"67_71Y7M",1,"M",67,71,7,null,null,"67_71Y7M",10,"M",67,71,7]
[null,"67_71Y8M",1,"M",67,71,8,null,null,"67_71Y8M",10,"M",67,71,8]
[null,"67_71Y9M",1,"M",67,71,9,null,null,"67_71Y9M",10,"M",67,71,9]
[null,"67_71Y10M",1,"M",67,71,10,null,null,"67_71Y10M",10,"M",67,71,10]
[null,"67_71Y11M",1,"M",67,71,11,null,null,"67_71Y11M",10,"M",67,71,11]
[null,"67_72Y0M",1,"M",67,72,0,null,null,"67_72Y0M",10,"M",67,72,0]
[null,"67_72Y1M",1,"M",67,72,1,null,null,"67_72Y1M",10,"M",67,72,1]
[null,"67_72Y2M",1,"M",67,72,2,null,null,"67_72Y2M",10,"M",67,72,2]
[null,"67_72Y3M",1,"M",67,72,3,null,null,"67_72Y3M",10,"M",67,72,3]
[null,"67_72Y4M",1,"M",67,72,4,null,null,"67_72Y4M",10,"M",67,72,4]
[null,"67_72Y5M",1,"M",67,72,5,null,null,"67_72Y5M",10,"M",67,72,5]
[null,"67_72Y6M",1,"M",67,72,6,null,null,"67_72Y6M",10,"M",67,72,6]
[null,"67_72Y7M",1,"M",67,72,7,null,null,"67_72Y7M",10,"M",67,72,7]
[null,"67_72Y8M",1,"M",67,72,8,null,null,"67_72Y8M",10,"M",67,72,8]
[null,"67_72Y9M",1,"M",67,72,9,null,null,"67_72Y9M",10,"M",67,72,9]
[null,"67_72Y10M",1,"M",67,72,10,null,null,"67_72Y10M",10,"M",67,72,10]
[null,"67_72Y11M",1,"M",67,72,11,null,null,"67_72Y11M",10,"M",67,72,11]
[null,"67_73Y0M",1,"M",67,73,0,null,null,"67_73Y0M",10,"M",67,73,0]
[null,"67_73Y1M",1,"M",67,73,1,null,null,"67_73Y1M",10,"M",67,73,1]
[null,"67_73Y2M",1,"M",67,73,2,null,null,"67_73Y2M",10,"M",67,73,2]
[null,"67_73Y3M",1,"M",67,73,3,null,null,"67_73Y3M",10,"M",67,73,3]
[null,"67_73Y4M",1,"M",67,73,4,null,null,"67_73Y4M",10,"M",67,73,4]
[null,"67_73Y5M",1,"M",67,73,5,null,null,"67_73Y5M",10,"M",67,73,5]
[null,"67_73Y6M",1,"M",67,73,6,null,null,"67_73Y6M",10,"M",67,73,6]
[null,"67_73Y7M",1,"M",67,73,7,null,null,"67_73Y7M",10,"M",67,73,7]
[null,"67_73Y8M",1,"M",67,73,8,null,null,"67_73Y8M",10,"M",67,73,8]
[null,"67_73Y9M",1,"M",67,73,9,null,null,"67_73Y9M",10,"M",67,73,9]
[null,"67_73Y10M",1,"M",67,73,10,null,null,"67_73Y10M",10,"M",67,73,10]
[null,"67_73Y11M",1,"M",67,73,11,null,null,"67_73Y11M",10,"M",67,73,11]
[null,"67_74Y0M",1,"M",67,74,0,null,null,"67_74Y0M",10,"M",67,74,0]
[null,{"$f":"E1262&\"_\"&F1262&\"Y\"&G1262&\"M\"","v":"67_74Y1M"},1,"M",67,74,1,null,null,"67_74Y1M",10,"M",67,74,1]
[null,"67_74Y2M",1,"M",67,74,2,null,null,"67_74Y2M",10,"M",67,74,2]
[null,"67_74Y3M",1,"M",67,74,3,null,null,"67_74Y3M",10,"M",67,74,3]
[null,"67_74Y4M",1,"M",67,74,4,null,null,"67_74Y4M",10,"M",67,74,4]
[null,"67_74Y5M",1,"M",67,74,5,null,null,"67_74Y5M",10,"M",67,74,5]
[null,"67_74Y6M",1,"M",67,74,6,null,null,"67_74Y6M",10,"M",67,74,6]
[null,"67_74Y7M",1,"M",67,74,7,null,null,"67_74Y7M",10,"M",67,74,7]
[null,"67_74Y8M",1,"M",67,74,8,null,null,"67_74Y8M",10,"M",67,74,8]
[null,"67_74Y9M",1,"M",67,74,9,null,null,"67_74Y9M",10,"M",67,74,9]
[null,"67_74Y10M",1,"M",67,74,10,null,null,"67_74Y10M",10,"M",67,74,10]
[null,"67_74Y11M",1,"M",67,74,11,null,null,"67_74Y11M",10,"M",67,74,11]
[null,"67_54Y0M",0.52,"F",67,54,0,null,null,"67_54Y0M",10,"F",67,54,0]
[null,"67_54Y1M",0.52200000000000002,"F",67,54,1,null,null,"67_54Y1M",10,"F",67,54,1]
[null,"67_54Y2M",0.52400000000000002,"F",67,54,2,null,null,"67_54Y2M",10,"F",67,54,2]
[null,"67_54Y3M",0.52500000000000002,"F",67,54,3,null,null,"67_54Y3M",10,"F",67,54,3]
[null,"67_54Y4M",0.52700000000000002,"F",67,54,4,null,null,"67_54Y4M",10,"F",67,54,4]
[null,"67_54Y5M",0.52900000000000003,"F",67,54,5,null,null,"67_54Y5M",10,"F",67,54,5]
[null,"67_54Y6M",0.53100000000000003,"F",67,54,6,null,null,"67_54Y6M",10,"F",67,54,6]
[null,"67_54Y7M",0.53300000000000003,"F",67,54,7,null,null,"67_54Y7M",10,"F",67,54,7]
[null,"67_54Y8M",0.53500000000000003,"F",67,54,8,null,null,"67_54Y8M",10,"F",67,54,8]
[null,"67_54Y9M",0.53700000000000003,"F",67,54,9,null,null,"67_54Y9M",10,"F",67,54,9]
[null,"67_54Y10M",0.53900000000000003,"F",67,54,10,null,null,"67_54Y10M",10,"F",67,54,10]
[null,"67_54Y11M",0.54100000000000004,"F",67,54,11,null,null,"67_54Y11M",10,"F",67,54,11]
[null,"67_55Y0M",0.54300000000000004,"F",67,55,0,null,null,"67_55Y0M",10,"F",67,55,0]
[null,"67_55Y1M",0.54500000000000004,"F",67,55,1,null,null,"67_55Y1M",10,"F",67,55,1]
[null,"67_55Y2M",0.54700000000000004,"F",67,55,2,null,null,"67_55Y2M",10,"F",67,55,2]
[null,"67_55Y3M",0.54900000000000004,"F",67,55,3,null,null,"67_55Y3M",10,"F",67,55,3]
[null,"67_55Y4M",0.55100000000000005,"F",67,55,4,null,null,"67_55Y4M",10,"F",67,55,4]
[null,"67_55Y5M",0.55400000000000005,"F",67,55,5,null,null,"67_55Y5M",10,"F",67,55,5]
[null,"67_55Y6M",0.55600000000000005,"F",67,55,6,null,null,"67_55Y6M",10,"F",67,55,6]
[null,"67_55Y7M",0.55800000000000005,"F",67,55,7,null,null,"67_55Y7M",10,"F",67,55,7]
[null,"67_55Y8M",0.56000000000000005,"F",67,55,8,null,null,"67_55Y8M",10,"F",67,55,8]
[null,"67_55Y9M",0.56200000000000006,"F",67,55,9,null,null,{"$f":"M1294&\"_\"&N1294&\"Y\"&O1294&\"M\"","v":"67_55Y9M"},10,"F",67,55,9]
[null,"67_55Y10M",0.56399999999999995,"F",67,55,10,null,null,"67_55Y10M",10,"F",67,55,10]
[null,"67_55Y11M",0.56599999999999995,"F",67,55,11,null,null,"67_55Y11M",10,"F",67,55,11]
[null,"67_56Y0M",0.56799999999999995,"F",67,56,0,null,null,"67_56Y0M",10,"F",67,56,0]
[null,"67_56Y1M",0.56999999999999995,"F",67,56,1,null,null,"67_56Y1M",10,"F",67,56,1]
[null,"67_56Y2M",0.57299999999999995,"F",67,56,2,null,null,"67_56Y2M",10,"F",67,56,2]
[null,"67_56Y3M",0.57499999999999996,"F",67,56,3,null,null,"67_56Y3M",10,"F",67,56,3]
[null,"67_56Y4M",0.57699999999999996,"F",67,56,4,null,null,"67_56Y4M",10,"F",67,56,4]
[null,"67_56Y5M",0.57899999999999996,"F",67,56,5,null,null,"67_56Y5M",10,"F",67,56,5]
[null,"67_56Y6M",0.58199999999999996,"F",67,56,6,null,null,"67_56Y6M",10,"F",67,56,6]
[null,"67_56Y7M",0.58399999999999996,"F",67,56,7,null,null,"67_56Y7M",10,"F",67,56,7]
[null,"67_56Y8M",0.58599999999999997,"F",67,56,8,null,null,"67_56Y8M",10,"F",67,56,8]
[null,"67_56Y9M",0.58799999999999997,"F",67,56,9,null,null,"67_56Y9M",10,"F",67,56,9]
[null,"67_56Y10M",0.59,"F",67,56,10,null,null,"67_56Y10M",10,"F",67,56,10]
[null,"67_56Y11M",0.59299999999999997,"F",67,56,11,null,null,"67_56Y11M",10,"F",67,56,11]
[null,"67_57Y0M",0.59499999999999997,"F",67,57,0,null,null,"67_57Y0M",10,"F",67,57,0]
[null,"67_57Y1M",0.59699999999999998,"F",67,57,1,null,null,"67_57Y1M",10,"F",67,57,1]
[null,"67_57Y2M",0.6,"F",67,57,2,null,null,"67_57Y2M",10,"F",67,57,2]
[null,"67_57Y3M",0.60199999999999998,"F",67,57,3,null,null,"67_57Y3M",10,"F",67,57,3]
[null,"67_57Y4M",0.60499999999999998,"F",67,57,4,null,null,"67_57Y4M",10,"F",67,57,4]
[null,"67_57Y5M",0.60699999999999998,"F",67,57,5,null,null,"67_57Y5M",10,"F",67,57,5]
[null,"67_57Y6M",0.60899999999999999,"F",67,57,6,null,null,"67_57Y6M",10,"F",67,57,6]
[null,"67_57Y7M",0.61199999999999999,"F",67,57,7,null,null,"67_57Y7M",10,"F",67,57,7]
[null,"67_57Y8M",0.61399999999999999,"F",67,57,8,null,null,"67_57Y8M",10,"F",67,57,8]
[null,"67_57Y9M",0.61599999999999999,"F",67,57,9,null,null,"67_57Y9M",10,"F",67,57,9]
[null,"67_57Y10M",0.61899999999999999,"F",67,57,10,null,null,"67_57Y10M",10,"F",67,57,10]
[null,"67_57Y11M",0.621,"F",67,57,11,null,null,"67_57Y11M",10,"F",67,57,11]
[null,"67_58Y0M",0.624,"F",67,58,0,null,null,"67_58Y0M",10,"F",67,58,0]
[null,"67_58Y1M",0.626,"F",67,58,1,null,null,"67_58Y1M",10,"F",67,58,1]
[null,"67_58Y2M",0.629,"F",67,58,2,null,null,"67_58Y2M",10,"F",67,58,2]
[null,"67_58Y3M",0.63100000000000001,"F",67,58,3,null,null,"67_58Y3M",10,"F",67,58,3]
[null,"67_58Y4M",0.63400000000000001,"F",67,58,4,null,null,"67_58Y4M",10,"F",67,58,4]
[null,{"$f":"E1326&\"_\"&F1326&\"Y\"&G1326&\"M\"","v":"67_58Y5M"},0.63600000000000001,"F",67,58,5,null,null,"67_58Y5M",10,"F",67,58,5]
[null,"67_58Y6M",0.63900000000000001,"F",67,58,6,null,null,"67_58Y6M",10,"F",67,58,6]
[null,"67_58Y7M",0.64100000000000001,"F",67,58,7,null,null,"67_58Y7M",10,"F",67,58,7]
[null,"67_58Y8M",0.64400000000000002,"F",67,58,8,null,null,"67_58Y8M",10,"F",67,58,8]
[null,"67_58Y9M",0.64700000000000002,"F",67,58,9,null,null,"67_58Y9M",10,"F",67,58,9]
[null,"67_58Y10M",0.64900000000000002,"F",67,58,10,null,null,"67_58Y10M",10,"F",67,58,10]
[null,"67_58Y11M",0.65200000000000002,"F",67,58,11,null,null,"67_58Y11M",10,"F",67,58,11]
[null,"67_59Y0M",0.65400000000000003,"F",67,59,0,null,null,"67_59Y0M",10,"F",67,59,0]
[null,"67_59Y1M",0.65700000000000003,"F",67,59,1,null,null,"67_59Y1M",10,"F",67,59,1]
[null,"67_59Y2M",0.66,"F",67,59,2,null,null,"67_59Y2M",10,"F",67,59,2]
[null,"67_59Y3M",0.66200000000000003,"F",67,59,3,null,null,"67_59Y3M",10,"F",67,59,3]
[null,"67_59Y4M",0.66500000000000004,"F",67,59,4,null,null,"67_59Y4M",10,"F",67,59,4]
[null,"67_59Y5M",0.66800000000000004,"F",67,59,5,null,null,"67_59Y5M",10,"F",67,59,5]
[null,"67_59Y6M",0.67100000000000004,"F",67,59,6,null,null,"67_59Y6M",10,"F",67,59,6]
[null,"67_59Y7M",0.67300000000000004,"F",67,59,7,null,null,"67_59Y7M",10,"F",67,59,7]
[null,"67_59Y8M",0.67600000000000005,"F",67,59,8,null,null,"67_59Y8M",10,"F",67,59,8]
[null,"67_59Y9M",0.67900000000000005,"F",67,59,9,null,null,"67_59Y9M",10,"F",67,59,9]
[null,"67_59Y10M",0.68200000000000005,"F",67,59,10,null,null,"67_59Y10M",10,"F",67,59,10]
[null,"67_59Y11M",0.68400000000000005,"F",67,59,11,null,null,"67_59Y11M",10,"F",67,59,11]
[null,"67_60Y0M",0.68700000000000006,"F",67,60,0,null,null,"67_60Y0M",10,"F",67,60,0]
[null,"67_60Y1M",0.69,"F",67,60,1,null,null,"67_60Y1M",10,"F",67,60,1]
[null,"67_60Y2M",0.69299999999999995,"F",67,60,2,null,null,"67_60Y2M",10,"F",67,60,2]
[null,"67_60Y3M",0.69599999999999995,"F",67,60,3,null,null,"67_60Y3M",10,"F",67,60,3]
[null,"67_60Y4M",0.69899999999999995,"F",67,60,4,null,null,"67_60Y4M",10,"F",67,60,4]
[null,"67_60Y5M",0.70199999999999996,"F",67,60,5,null,null,"67_60Y5M",10,"F",67,60,5]
[null,"67_60Y6M",0.70499999999999996,"F",67,60,6,null,null,"67_60Y6M",10,"F",67,60,6]
[null,"67_60Y7M",0.70799999999999996,"F",67,60,7,null,null,"67_60Y7M",10,"F",67,60,7]
[null,"67_60Y8M",0.71099999999999997,"F",67,60,8,null,null,"67_60Y8M",10,"F",67,60,8]
[null,"67_60Y9M",0.71299999999999997,"F",67,60,9,null,null,"67_60Y9M",10,"F",67,60,9]
[null,"67_60Y10M",0.71599999999999997,"F",67,60,10,null,null,"67_60Y10M",10,"F",67,60,10]
[null,"67_60Y11M",0.71899999999999997,"F",67,60,11,null,null,"67_60Y11M",10,"F",67,60,11]
[null,"67_61Y0M",0.72199999999999998,"F",67,61,0,null,null,"67_61Y0M",10,"F",67,61,0]
[null,"67_61Y1M",0.72599999999999998,"F",67,61,1,null,null,{"$f":"M1358&\"_\"&N1358&\"Y\"&O1358&\"M\"","v":"67_61Y1M"},10,"F",67,61,1]
[null,"67_61Y2M",0.72899999999999998,"F",67,61,2,null,null,"67_61Y2M",10,"F",67,61,2]
[null,"67_61Y3M",0.73199999999999998,"F",67,61,3,null,null,"67_61Y3M",10,"F",67,61,3]
[null,"67_61Y4M",0.73499999999999999,"F",67,61,4,null,null,"67_61Y4M",10,"F",67,61,4]
[null,"67_61Y5M",0.73799999999999999,"F",67,61,5,null,null,"67_61Y5M",10,"F",67,61,5]
[null,"67_61Y6M",0.74099999999999999,"F",67,61,6,null,null,"67_61Y6M",10,"F",67,61,6]
[null,"67_61Y7M",0.74399999999999999,"F",67,61,7,null,null,"67_61Y7M",10,"F",67,61,7]
[null,"67_61Y8M",0.748,"F",67,61,8,null,null,"67_61Y8M",10,"F",67,61,8]
[null,"67_61Y9M",0.751,"F",67,61,9,null,null,"67_61Y9M",10,"F",67,61,9]
[null,"67_61Y10M",0.754,"F",67,61,10,null,null,"67_61Y10M",10,"F",67,61,10]
[null,"67_61Y11M",0.75700000000000001,"F",67,61,11,null,null,"67_61Y11M",10,"F",67,61,11]
[null,"67_62Y0M",0.76,"F",67,62,0,null,null,"67_62Y0M",10,"F",67,62,0]
[null,"67_62Y1M",0.76400000000000001,"F",67,62,1,null,null,"67_62Y1M",10,"F",67,62,1]
[null,"67_62Y2M",0.76700000000000002,"F",67,62,2,null,null,"67_62Y2M",10,"F",67,62,2]
[null,"67_62Y3M",0.77100000000000002,"F",67,62,3,null,null,"67_62Y3M",10,"F",67,62,3]
[null,"67_62Y4M",0.77400000000000002,"F",67,62,4,null,null,"67_62Y4M",10,"F",67,62,4]
[null,"67_62Y5M",0.77700000000000002,"F",67,62,5,null,null,"67_62Y5M",10,"F",67,62,5]
[null,"67_62Y6M",0.78100000000000003,"F",67,62,6,null,null,"67_62Y6M",10,"F",67,62,6]
[null,"67_62Y7M",0.78400000000000003,"F",67,62,7,null,null,"67_62Y7M",10,"F",67,62,7]
[null,"67_62Y8M",0.78800000000000003,"F",67,62,8,null,null,"67_62Y8M",10,"F",67,62,8]
[null,"67_62Y9M",0.79100000000000004,"F",67,62,9,null,null,"67_62Y9M",10,"F",67,62,9]
[null,"67_62Y10M",0.79400000000000004,"F",67,62,10,null,null,"67_62Y10M",10,"F",67,62,10]
[null,"67_62Y11M",0.79800000000000004,"F",67,62,11,null,null,"67_62Y11M",10,"F",67,62,11]
[null,"67_63Y0M",0.80100000000000005,"F",67,63,0,null,null,"67_63Y0M",10,"F",67,63,0]
[null,"67_63Y1M",0.80500000000000005,"F",67,63,1,null,null,"67_63Y1M",10,"F",67,63,1]
[null,"67_63Y2M",0.80900000000000005,"F",67,63,2,null,null,"67_63Y2M",10,"F",67,63,2]
[null,"67_63Y3M",0.81200000000000006,"F",67,63,3,null,null,"67_63Y3M",10,"F",67,63,3]
[null,"67_63Y4M",0.81599999999999995,"F",67,63,4,null,null,"67_63Y4M",10,"F",67,63,4]
[null,"67_63Y5M",0.82,"F",67,63,5,null,null,"67_63Y5M",10,"F",67,63,5]
[null,"67_63Y6M",0.82299999999999995,"F",67,63,6,null,null,"67_63Y6M",10,"F",67,63,6]
[null,"67_63Y7M",0.82699999999999996,"F",67,63,7,null,null,"67_63Y7M",10,"F",67,63,7]
[null,"67_63Y8M",0.83099999999999996,"F",67,63,8,null,null,"67_63Y8M",10,"F",67,63,8]
[null,{"$f":"E1390&\"_\"&F1390&\"Y\"&G1390&\"M\"","v":"67_63Y9M"},0.83399999999999996,"F",67,63,9,null,null,"67_63Y9M",10,"F",67,63,9]
[null,"67_63Y10M",0.83799999999999997,"F",67,63,10,null,null,"67_63Y10M",10,"F",67,63,10]
[null,"67_63Y11M",0.84199999999999997,"F",67,63,11,null,null,"67_63Y11M",10,"F",67,63,11]
[null,"67_64Y0M",0.84599999999999997,"F",67,64,0,null,null,"67_64Y0M",10,"F",67,64,0]
[null,"67_64Y1M",0.85,"F",67,64,1,null,null,"67_64Y1M",10,"F",67,64,1]
[null,"67_64Y2M",0.85399999999999998,"F",67,64,2,null,null,"67_64Y2M",10,"F",67,64,2]
[null,"67_64Y3M",0.85799999999999998,"F",67,64,3,null,null,"67_64Y3M",10,"F",67,64,3]
[null,"67_64Y4M",0.86199999999999999,"F",67,64,4,null,null,"67_64Y4M",10,"F",67,64,4]
[null,"67_64Y5M",0.86599999999999999,"F",67,64,5,null,null,"67_64Y5M",10,"F",67,64,5]
[null,"67_64Y6M",0.87,"F",67,64,6,null,null,"67_64Y6M",10,"F",67,64,6]
[null,"67_64Y7M",0.874,"F",67,64,7,null,null,"67_64Y7M",10,"F",67,64,7]
[null,"67_64Y8M",0.878,"F",67,64,8,null,null,"67_64Y8M",10,"F",67,64,8]
[null,"67_64Y9M",0.88200000000000001,"F",67,64,9,null,null,"67_64Y9M",10,"F",67,64,9]
[null,"67_64Y10M",0.88600000000000001,"F",67,64,10,null,null,"67_64Y10M",10,"F",67,64,10]
[null,"67_64Y11M",0.89,"F",67,64,11,null,null,"67_64Y11M",10,"F",67,64,11]
[null,"67_65Y0M",0.89400000000000002,"F",67,65,0,null,null,"67_65Y0M",10,"F",67,65,0]
[null,"67_65Y1M",0.89800000000000002,"F",67,65,1,null,null,"67_65Y1M",10,"F",67,65,1]
[null,"67_65Y2M",0.90200000000000002,"F",67,65,2,null,null,"67_65Y2M",10,"F",67,65,2]
[null,"67_65Y3M",0.90700000000000003,"F",67,65,3,null,null,"67_65Y3M",10,"F",67,65,3]
[null,"67_65Y4M",0.91100000000000003,"F",67,65,4,null,null,"67_65Y4M",10,"F",67,65,4]
[null,"67_65Y5M",0.91500000000000004,"F",67,65,5,null,null,"67_65Y5M",10,"F",67,65,5]
[null,"67_65Y6M",0.92,"F",67,65,6,null,null,"67_65Y6M",10,"F",67,65,6]
[null,"67_65Y7M",0.92400000000000004,"F",67,65,7,null,null,"67_65Y7M",10,"F",67,65,7]
[null,"67_65Y8M",0.92800000000000005,"F",67,65,8,null,null,"67_65Y8M",10,"F",67,65,8]
[null,"67_65Y9M",0.93300000000000005,"F",67,65,9,null,null,"67_65Y9M",10,"F",67,65,9]
[null,"67_65Y10M",0.93700000000000006,"F",67,65,10,null,null,"67_65Y10M",10,"F",67,65,10]
[null,"67_65Y11M",0.94099999999999995,"F",67,65,11,null,null,"67_65Y11M",10,"F",67,65,11]
[null,"67_66Y0M",0.94599999999999995,"F",67,66,0,null,null,"67_66Y0M",10,"F",67,66,0]
[null,"67_66Y1M",0.95099999999999996,"F",67,66,1,null,null,"67_66Y1M",10,"F",67,66,1]
[null,"67_66Y2M",0.95499999999999996,"F",67,66,2,null,null,"67_66Y2M",10,"F",67,66,2]
[null,"67_66Y3M",0.96,"F",67,66,3,null,null,"67_66Y3M",10,"F",67,66,3]
[null,"67_66Y4M",0.96499999999999997,"F",67,66,4,null,null,"67_66Y4M",10,"F",67,66,4]
[null,"67_66Y5M",0.96899999999999997,"F",67,66,5,null,null,{"$f":"M1422&\"_\"&N1422&\"Y\"&O1422&\"M\"","v":"67_66Y5M"},10,"F",67,66,5]
[null,"67_66Y6M",0.97399999999999998,"F",67,66,6,null,null,"67_66Y6M",10,"F",67,66,6]
[null,"67_66Y7M",0.97899999999999998,"F",67,66,7,null,null,"67_66Y7M",10,"F",67,66,7]
[null,"67_66Y8M",0.98399999999999999,"F",67,66,8,null,null,"67_66Y8M",10,"F",67,66,8]
[null,"67_66Y9M",0.98799999999999999,"F",67,66,9,null,null,"67_66Y9M",10,"F",67,66,9]
[null,"67_66Y10M",0.99299999999999999,"F",67,66,10,null,null,"67_66Y10M",10,"F",67,66,10]
[null,"67_66Y11M",0.995,"F",67,66,11,null,null,"67_66Y11M",10,"F",67,66,11]
[null,"67_67Y0M",1,"F",67,67,0,null,null,"67_67Y0M",10,"F",67,67,0]
[null,"67_67Y1M",1,"F",67,67,1,null,null,"67_67Y1M",10,"F",67,67,1]
[null,"67_67Y2M",1,"F",67,67,2,null,null,"67_67Y2M",10,"F",67,67,2]
[null,"67_67Y3M",1,"F",67,67,3,null,null,"67_67Y3M",10,"F",67,67,3]
[null,"67_67Y4M",1,"F",67,67,4,null,null,"67_67Y4M",10,"F",67,67,4]
[null,"67_67Y5M",1,"F",67,67,5,null,null,"67_67Y5M",10,"F",67,67,5]
[null,"67_67Y6M",1,"F",67,67,6,null,null,"67_67Y6M",10,"F",67,67,6]
[null,"67_67Y7M",1,"F",67,67,7,null,null,"67_67Y7M",10,"F",67,67,7]
[null,"67_67Y8M",1,"F",67,67,8,null,null,"67_67Y8M",10,"F",67,67,8]
[null,"67_67Y9M",1,"F",67,67,9,null,null,"67_67Y9M",10,"F",67,67,9]
[null,"67_67Y10M",1,"F",67,67,10,null,null,"67_67Y10M",10,"F",67,67,10]
[null,"67_67Y11M",1,"F",67,67,11,null,null,"67_67Y11M",10,"F",67,67,11]
[null,"67_68Y0M",1,"F",67,68,0,null,null,"67_68Y0M",10,"F",67,68,0]
[null,"67_68Y1M",1,"F",67,68,1,null,null,"67_68Y1M",10,"F",67,68,1]
[null,"67_68Y2M",1,"F",67,68,2,null,null,"67_68Y2M",10,"F",67,68,2]
[null,"67_68Y3M",1,"F",67,68,3,null,null,"67_68Y3M",10,"F",67,68,3]
[null,"67_68Y4M",1,"F",67,68,4,null,null,"67_68Y4M",10,"F",67,68,4]
[null,"67_68Y5M",1,"F",67,68,5,null,null,"67_68Y5M",10,"F",67,68,5]
[null,"67_68Y6M",1,"F",67,68,6,null,null,"67_68Y6M",10,"F",67,68,6]
[null,"67_68Y7M",1,"F",67,68,7,null,null,"67_68Y7M",10,"F",67,68,7]
[null,"67_68Y8M",1,"F",67,68,8,null,null,"67_68Y8M",10,"F",67,68,8]
[null,"67_68Y9M",1,"F",67,68,9,null,null,"67_68Y9M",10,"F",67,68,9]
[null,"67_68Y10M",1,"F",67,68,10,null,null,"67_68Y10M",10,"F",67,68,10]
[null,"67_68Y11M",1,"F",67,68,11,null,null,"67_68Y11M",10,"F",67,68,11]
[null,"67_69Y0M",1,"F",67,69,0,null,null,"67_69Y0M",10,"F",67,69,0]
[null,{"$f":"E1454&\"_\"&F1454&\"Y\"&G1454&\"M\"","v":"67_69Y1M"},1,"F",67,69,1,null,null,"67_69Y1M",10,"F",67,69,1]
[null,"67_69Y2M",1,"F",67,69,2,null,null,"67_69Y2M",10,"F",67,69,2]
[null,"67_69Y3M",1,"F",67,69,3,null,null,"67_69Y3M",10,"F",67,69,3]
[null,"67_69Y4M",1,"F",67,69,4,null,null,"67_69Y4M",10,"F",67,69,4]
[null,"67_69Y5M",1,"F",67,69,5,null,null,"67_69Y5M",10,"F",67,69,5]
[null,"67_69Y6M",1,"F",67,69,6,null,null,"67_69Y6M",10,"F",67,69,6]
[null,"67_69Y7M",1,"F",67,69,7,null,null,"67_69Y7M",10,"F",67,69,7]
[null,"67_69Y8M",1,"F",67,69,8,null,null,"67_69Y8M",10,"F",67,69,8]
[null,"67_69Y9M",1,"F",67,69,9,null,null,"67_69Y9M",10,"F",67,69,9]
[null,"67_69Y10M",1,"F",67,69,10,null,null,"67_69Y10M",10,"F",67,69,10]
[null,"67_69Y11M",1,"F",67,69,11,null,null,"67_69Y11M",10,"F",67,69,11]
[null,"67_70Y0M",1,"F",67,70,0,null,null,"67_70Y0M",10,"F",67,70,0]
[null,"67_70Y1M",1,"F",67,70,1,null,null,"67_70Y1M",10,"F",67,70,1]
[null,"67_70Y2M",1,"F",67,70,2,null,null,"67_70Y2M",10,"F",67,70,2]
[null,"67_70Y3M",1,"F",67,70,3,null,null,"67_70Y3M",10,"F",67,70,3]
[null,"67_70Y4M",1,"F",67,70,4,null,null,"67_70Y4M",10,"F",67,70,4]
[null,"67_70Y5M",1,"F",67,70,5,null,null,"67_70Y5M",10,"F",67,70,5]
[null,"67_70Y6M",1,"F",67,70,6,null,null,"67_70Y6M",10,"F",67,70,6]
[null,"67_70Y7M",1,"F",67,70,7,null,null,"67_70Y7M",10,"F",67,70,7]
[null,"67_70Y8M",1,"F",67,70,8,null,null,"67_70Y8M",10,"F",67,70,8]
[null,"67_70Y9M",1,"F",67,70,9,null,null,"67_70Y9M",10,"F",67,70,9]
[null,"67_70Y10M",1,"F",67,70,10,null,null,"67_70Y10M",10,"F",67,70,10]
[null,"67_70Y11M",1,"F",67,70,11,null,null,"67_70Y11M",10,"F",67,70,11]
[null,"67_71Y0M",1,"F",67,71,0,null,null,"67_71Y0M",10,"F",67,71,0]
[null,"67_71Y1M",1,"F",67,71,1,null,null,"67_71Y1M",10,"F",67,71,1]
[null,"67_71Y2M",1,"F",67,71,2,null,null,"67_71Y2M",10,"F",67,71,2]
[null,"67_71Y3M",1,"F",67,71,3,null,null,"67_71Y3M",10,"F",67,71,3]
[null,"67_71Y4M",1,"F",67,71,4,null,null,"67_71Y4M",10,"F",67,71,4]
[null,"67_71Y5M",1,"F",67,71,5,null,null,"67_71Y5M",10,"F",67,71,5]
[null,"67_71Y6M",1,"F",67,71,6,null,null,"67_71Y6M",10,"F",67,71,6]
[null,"67_71Y7M",1,"F",67,71,7,null,null,"67_71Y7M",10,"F",67,71,7]
[null,"67_71Y8M",1,"F",67,71,8,null,null,"67_71Y8M",10,"F",67,71,8]
[null,"67_71Y9M",1,"F",67,71,9,null,null,{"$f":"M1486&\"_\"&N1486&\"Y\"&O1486&\"M\"","v":"67_71Y9M"},10,"F",67,71,9]
[null,"67_71Y10M",1,"F",67,71,10,null,null,"67_71Y10M",10,"F",67,71,10]
[null,"67_71Y11M",1,"F",67,71,11,null,null,"67_71Y11M",10,"F",67,71,11]
[null,"67_72Y0M",1,"F",67,72,0,null,null,"67_72Y0M",10,"F",67,72,0]
[null,"67_72Y1M",1,"F",67,72,1,null,null,"67_72Y1M",10,"F",67,72,1]
[null,"67_72Y2M",1,"F",67,72,2,null,null,"67_72Y2M",10,"F",67,72,2]
[null,"67_72Y3M",1,"F",67,72,3,null,null,"67_72Y3M",10,"F",67,72,3]
[null,"67_72Y4M",1,"F",67,72,4,null,null,"67_72Y4M",10,"F",67,72,4]
[null,"67_72Y5M",1,"F",67,72,5,null,null,"67_72Y5M",10,"F",67,72,5]
[null,"67_72Y6M",1,"F",67,72,6,null,null,"67_72Y6M",10,"F",67,72,6]
[null,"67_72Y7M",1,"F",67,72,7,null,null,"67_72Y7M",10,"F",67,72,7]
[null,"67_72Y8M",1,"F",67,72,8,null,null,"67_72Y8M",10,"F",67,72,8]
[null,"67_72Y9M",1,"F",67,72,9,null,null,"67_72Y9M",10,"F",67,72,9]
[null,"67_72Y10M",1,"F",67,72,10,null,null,"67_72Y10M",10,"F",67,72,10]
[null,"67_72Y11M",1,"F",67,72,11,null,null,"67_72Y11M",10,"F",67,72,11]
[null,"67_73Y0M",1,"F",67,73,0,null,null,"67_73Y0M",10,"F",67,73,0]
[null,"67_73Y1M",1,"F",67,73,1,null,null,"67_73Y1M",10,"F",67,73,1]
[null,"67_73Y2M",1,"F",67,73,2,null,null,"67_73Y2M",10,"F",67,73,2]
[null,"67_73Y3M",1,"F",67,73,3,null,null,"67_73Y3M",10,"F",67,73,3]
[null,"67_73Y4M",1,"F",67,73,4,null,null,"67_73Y4M",10,"F",67,73,4]
[null,"67_73Y5M",1,"F",67,73,5,null,null,"67_73Y5M",10,"F",67,73,5]
[null,"67_73Y6M",1,"F",67,73,6,null,null,"67_73Y6M",10,"F",67,73,6]
[null,"67_73Y7M",1,"F",67,73,7,null,null,"67_73Y7M",10,"F",67,73,7]
[null,"67_73Y8M",1,"F",67,73,8,null,null,"67_73Y8M",10,"F",67,73,8]
[null,"67_73Y9M",1,"F",67,73,9,null,null,"67_73Y9M",10,"F",67,73,9]
[null,"67_73Y10M",1,"F",67,73,10,null,null,"67_73Y10M",10,"F",67,73,10]
[null,"67_73Y11M",1,"F",67,73,11,null,null,"67_73Y11M",10,"F",67,73,11]
[null,"67_74Y0M",1,"F",67,74,0,null,null,"67_74Y0M",10,"F",67,74,0]
[null,"67_74Y1M",1,"F",67,74,1,null,null,"67_74Y1M",10,"F",67,74,1]
[null,"67_74Y2M",1,"F",67,74,2,null,null,"67_74Y2M",10,"F",67,74,2]
[null,"67_74Y3M",1,"F",67,74,3,null,null,"67_74Y3M",10,"F",67,74,3]
[null,"67_74Y4M",1,"F",67,74,4,null,null,"67_74Y4M",10,"F",67,74,4]
[null,{"$f":"E1518&\"_\"&F1518&\"Y\"&G1518&\"M\"","v":"67_74Y5M"},1,"F",67,74,5,null,null,"67_74Y5M",10,"F",67,74,5]
[null,"67_74Y6M",1,"F",67,74,6,null,null,"67_74Y6M",10,"F",67,74,6]
[null,"67_74Y7M",1,"F",67,74,7,null,null,"67_74Y7M",10,"F",67,74,7]
[null,"67_74Y8M",1,"F",67,74,8,null,null,"67_74Y8M",10,"F",67,74,8]
[null,"67_74Y9M",1,"F",67,74,9,null,null,"67_74Y9M",10,"F",67,74,9]
[null,"67_74Y10M",1,"F",67,74,10,null,null,"67_74Y10M",10,"F",67,74,10]
[null,"67_74Y11M",1,"F",67,74,11,null,null,"67_74Y11M",10,"F",67,74,11]
[null,"68_54Y0M",0.49099999999999999,"M",68,54,0,null,null,"68_54Y0M",10,"M",68,54,0]
[null,"68_54Y1M",0.49299999999999999,"M",68,54,1,null,null,"68_54Y1M",10,"M",68,54,1]
[null,"68_54Y2M",0.495,"M",68,54,2,null,null,"68_54Y2M",10,"M",68,54,2]
[null,"68_54Y3M",0.496,"M",68,54,3,null,null,"68_54Y3M",10,"M",68,54,3]
[null,"68_54Y4M",0.498,"M",68,54,4,null,null,"68_54Y4M",10,"M",68,54,4]
[null,"68_54Y5M",0.5,"M",68,54,5,null,null,"68_54Y5M",10,"M",68,54,5]
[null,"68_54Y6M",0.502,"M",68,54,6,null,null,"68_54Y6M",10,"M",68,54,6]
[null,"68_54Y7M",0.504,"M",68,54,7,null,null,"68_54Y7M",10,"M",68,54,7]
[null,"68_54Y8M",0.50600000000000001,"M",68,54,8,null,null,"68_54Y8M",10,"M",68,54,8]
[null,"68_54Y9M",0.50800000000000001,"M",68,54,9,null,null,"68_54Y9M",10,"M",68,54,9]
[null,"68_54Y10M",0.50900000000000001,"M",68,54,10,null,null,"68_54Y10M",10,"M",68,54,10]
[null,"68_54Y11M",0.51100000000000001,"M",68,54,11,null,null,"68_54Y11M",10,"M",68,54,11]
[null,"68_55Y0M",0.51300000000000001,"M",68,55,0,null,null,"68_55Y0M",10,"M",68,55,0]
[null,"68_55Y1M",0.51500000000000001,"M",68,55,1,null,null,"68_55Y1M",10,"M",68,55,1]
[null,"68_55Y2M",0.51700000000000002,"M",68,55,2,null,null,"68_55Y2M",10,"M",68,55,2]
[null,"68_55Y3M",0.51900000000000002,"M",68,55,3,null,null,"68_55Y3M",10,"M",68,55,3]
[null,"68_55Y4M",0.52100000000000002,"M",68,55,4,null,null,"68_55Y4M",10,"M",68,55,4]
[null,"68_55Y5M",0.52300000000000002,"M",68,55,5,null,null,"68_55Y5M",10,"M",68,55,5]
[null,"68_55Y6M",0.52500000000000002,"M",68,55,6,null,null,"68_55Y6M",10,"M",68,55,6]
[null,"68_55Y7M",0.52700000000000002,"M",68,55,7,null,null,"68_55Y7M",10,"M",68,55,7]
[null,"68_55Y8M",0.52900000000000003,"M",68,55,8,null,null,"68_55Y8M",10,"M",68,55,8]
[null,"68_55Y9M",0.53100000000000003,"M",68,55,9,null,null,"68_55Y9M",10,"M",68,55,9]
[null,"68_55Y10M",0.53300000000000003,"M",68,55,10,null,null,"68_55Y10M",10,"M",68,55,10]
[null,"68_55Y11M",0.53500000000000003,"M",68,55,11,null,null,"68_55Y11M",10,"M",68,55,11]
[null,"68_56Y0M",0.53700000000000003,"M",68,56,0,null,null,"68_56Y0M",10,"M",68,56,0]
[null,"68_56Y1M",0.53900000000000003,"M",68,56,1,null,null,{"$f":"M1550&\"_\"&N1550&\"Y\"&O1550&\"M\"","v":"68_56Y1M"},10,"M",68,56,1]
[null,"68_56Y2M",0.54100000000000004,"M",68,56,2,null,null,"68_56Y2M",10,"M",68,56,2]
[null,"68_56Y3M",0.54300000000000004,"M",68,56,3,null,null,"68_56Y3M",10,"M",68,56,3]
[null,"68_56Y4M",0.54500000000000004,"M",68,56,4,null,null,"68_56Y4M",10,"M",68,56,4]
[null,"68_56Y5M",0.54700000000000004,"M",68,56,5,null,null,"68_56Y5M",10,"M",68,56,5]
[null,"68_56Y6M",0.54900000000000004,"M",68,56,6,null,null,"68_56Y6M",10,"M",68,56,6]
[null,"68_56Y7M",0.55100000000000005,"M",68,56,7,null,null,"68_56Y7M",10,"M",68,56,7]
[null,"68_56Y8M",0.55300000000000005,"M",68,56,8,null,null,"68_56Y8M",10,"M",68,56,8]
[null,"68_56Y9M",0.55600000000000005,"M",68,56,9,null,null,"68_56Y9M",10,"M",68,56,9]
[null,"68_56Y10M",0.55800000000000005,"M",68,56,10,null,null,"68_56Y10M",10,"M",68,56,10]
[null,"68_56Y11M",0.56000000000000005,"M",68,56,11,null,null,"68_56Y11M",10,"M",68,56,11]
[null,"68_57Y0M",0.56200000000000006,"M",68,57,0,null,null,"68_57Y0M",10,"M",68,57,0]
[null,"68_57Y1M",0.56399999999999995,"M",68,57,1,null,null,"68_57Y1M",10,"M",68,57,1]
[null,"68_57Y2M",0.56599999999999995,"M",68,57,2,null,null,"68_57Y2M",10,"M",68,57,2]
[null,"68_57Y3M",0.56899999999999995,"M",68,57,3,null,null,"68_57Y3M",10,"M",68,57,3]
[null,"68_57Y4M",0.57099999999999995,"M",68,57,4,null,null,"68_57Y4M",10,"M",68,57,4]
[null,"68_57Y5M",0.57299999999999995,"M",68,57,5,null,null,"68_57Y5M",10,"M",68,57,5]
[null,"68_57Y6M",0.57499999999999996,"M",68,57,6,null,null,"68_57Y6M",10,"M",68,57,6]
[null,"68_57Y7M",0.57799999999999996,"M",68,57,7,null,null,"68_57Y7M",10,"M",68,57,7]
[null,"68_57Y8M",0.57999999999999996,"M",68,57,8,null,null,"68_57Y8M",10,"M",68,57,8]
[null,"68_57Y9M",0.58199999999999996,"M",68,57,9,null,null,"68_57Y9M",10,"M",68,57,9]
[null,"68_57Y10M",0.58399999999999996,"M",68,57,10,null,null,"68_57Y10M",10,"M",68,57,10]
[null,"68_57Y11M",0.58599999999999997,"M",68,57,11,null,null,"68_57Y11M",10,"M",68,57,11]
[null,"68_58Y0M",0.58899999999999997,"M",68,58,0,null,null,"68_58Y0M",10,"M",68,58,0]
[null,"68_58Y1M",0.59099999999999997,"M",68,58,1,null,null,"68_58Y1M",10,"M",68,58,1]
[null,"68_58Y2M",0.59399999999999997,"M",68,58,2,null,null,"68_58Y2M",10,"M",68,58,2]
[null,"68_58Y3M",0.59599999999999997,"M",68,58,3,null,null,"68_58Y3M",10,"M",68,58,3]
[null,"68_58Y4M",0.59799999999999998,"M",68,58,4,null,null,"68_58Y4M",10,"M",68,58,4]
[null,"68_58Y5M",0.60099999999999998,"M",68,58,5,null,null,"68_58Y5M",10,"M",68,58,5]
[null,"68_58Y6M",0.60299999999999998,"M",68,58,6,null,null,"68_58Y6M",10,"M",68,58,6]
[null,"68_58Y7M",0.60499999999999998,"M",68,58,7,null,null,"68_58Y7M",10,"M",68,58,7]
[null,"68_58Y8M",0.60799999999999998,"M",68,58,8,null,null,"68_58Y8M",10,"M",68,58,8]
[null,{"$f":"E1582&\"_\"&F1582&\"Y\"&G1582&\"M\"","v":"68_58Y9M"},0.61,"M",68,58,9,null,null,"68_58Y9M",10,"M",68,58,9]
[null,"68_58Y10M",0.61299999999999999,"M",68,58,10,null,null,"68_58Y10M",10,"M",68,58,10]
[null,"68_58Y11M",0.61499999999999999,"M",68,58,11,null,null,"68_58Y11M",10,"M",68,58,11]
[null,"68_59Y0M",0.61799999999999999,"M",68,59,0,null,null,"68_59Y0M",10,"M",68,59,0]
[null,"68_59Y1M",0.62,"M",68,59,1,null,null,"68_59Y1M",10,"M",68,59,1]
[null,"68_59Y2M",0.623,"M",68,59,2,null,null,"68_59Y2M",10,"M",68,59,2]
[null,"68_59Y3M",0.625,"M",68,59,3,null,null,"68_59Y3M",10,"M",68,59,3]
[null,"68_59Y4M",0.628,"M",68,59,4,null,null,"68_59Y4M",10,"M",68,59,4]
[null,"68_59Y5M",0.63,"M",68,59,5,null,null,"68_59Y5M",10,"M",68,59,5]
[null,"68_59Y6M",0.63300000000000001,"M",68,59,6,null,null,"68_59Y6M",10,"M",68,59,6]
[null,"68_59Y7M",0.63500000000000001,"M",68,59,7,null,null,"68_59Y7M",10,"M",68,59,7]
[null,"68_59Y8M",0.63800000000000001,"M",68,59,8,null,null,"68_59Y8M",10,"M",68,59,8]
[null,"68_59Y9M",0.64100000000000001,"M",68,59,9,null,null,"68_59Y9M",10,"M",68,59,9]
[null,"68_59Y10M",0.64300000000000002,"M",68,59,10,null,null,"68_59Y10M",10,"M",68,59,10]
[null,"68_59Y11M",0.64600000000000002,"M",68,59,11,null,null,"68_59Y11M",10,"M",68,59,11]
[null,"68_60Y0M",0.64800000000000002,"M",68,60,0,null,null,"68_60Y0M",10,"M",68,60,0]
[null,"68_60Y1M",0.65100000000000002,"M",68,60,1,null,null,"68_60Y1M",10,"M",68,60,1]
[null,"68_60Y2M",0.65400000000000003,"M",68,60,2,null,null,"68_60Y2M",10,"M",68,60,2]
[null,"68_60Y3M",0.65700000000000003,"M",68,60,3,null,null,"68_60Y3M",10,"M",68,60,3]
[null,"68_60Y4M",0.65900000000000003,"M",68,60,4,null,null,"68_60Y4M",10,"M",68,60,4]
[null,"68_60Y5M",0.66200000000000003,"M",68,60,5,null,null,"68_60Y5M",10,"M",68,60,5]
[null,"68_60Y6M",0.66500000000000004,"M",68,60,6,null,null,"68_60Y6M",10,"M",68,60,6]
[null,"68_60Y7M",0.66800000000000004,"M",68,60,7,null,null,"68_60Y7M",10,"M",68,60,7]
[null,"68_60Y8M",0.67,"M",68,60,8,null,null,"68_60Y8M",10,"M",68,60,8]
[null,"68_60Y9M",0.67300000000000004,"M",68,60,9,null,null,"68_60Y9M",10,"M",68,60,9]
[null,"68_60Y10M",0.67600000000000005,"M",68,60,10,null,null,"68_60Y10M",10,"M",68,60,10]
[null,"68_60Y11M",0.67900000000000005,"M",68,60,11,null,null,"68_60Y11M",10,"M",68,60,11]
[null,"68_61Y0M",0.68200000000000005,"M",68,61,0,null,null,"68_61Y0M",10,"M",68,61,0]
[null,"68_61Y1M",0.68500000000000005,"M",68,61,1,null,null,"68_61Y1M",10,"M",68,61,1]
[null,"68_61Y2M",0.68700000000000006,"M",68,61,2,null,null,"68_61Y2M",10,"M",68,61,2]
[null,"68_61Y3M",0.69,"M",68,61,3,null,null,"68_61Y3M",10,"M",68,61,3]
[null,"68_61Y4M",0.69299999999999995,"M",68,61,4,null,null,"68_61Y4M",10,"M",68,61,4]
[null,"68_61Y5M",0.69599999999999995,"M",68,61,5,null,null,{"$f":"M1614&\"_\"&N1614&\"Y\"&O1614&\"M\"","v":"68_61Y5M"},10,"M",68,61,5]
[null,"68_61Y6M",0.69899999999999995,"M",68,61,6,null,null,"68_61Y6M",10,"M",68,61,6]
[null,"68_61Y7M",0.70199999999999996,"M",68,61,7,null,null,"68_61Y7M",10,"M",68,61,7]
[null,"68_61Y8M",0.70499999999999996,"M",68,61,8,null,null,"68_61Y8M",10,"M",68,61,8]
[null,"68_61Y9M",0.70799999999999996,"M",68,61,9,null,null,"68_61Y9M",10,"M",68,61,9]
[null,"68_61Y10M",0.71099999999999997,"M",68,61,10,null,null,"68_61Y10M",10,"M",68,61,10]
[null,"68_61Y11M",0.71399999999999997,"M",68,61,11,null,null,"68_61Y11M",10,"M",68,61,11]
[null,"68_62Y0M",0.71699999999999997,"M",68,62,0,null,null,"68_62Y0M",10,"M",68,62,0]
[null,"68_62Y1M",0.72,"M",68,62,1,null,null,"68_62Y1M",10,"M",68,62,1]
[null,"68_62Y2M",0.72399999999999998,"M",68,62,2,null,null,"68_62Y2M",10,"M",68,62,2]
[null,"68_62Y3M",0.72699999999999998,"M",68,62,3,null,null,"68_62Y3M",10,"M",68,62,3]
[null,"68_62Y4M",0.73,"M",68,62,4,null,null,"68_62Y4M",10,"M",68,62,4]
[null,"68_62Y5M",0.73299999999999998,"M",68,62,5,null,null,"68_62Y5M",10,"M",68,62,5]
[null,"68_62Y6M",0.73599999999999999,"M",68,62,6,null,null,"68_62Y6M",10,"M",68,62,6]
[null,"68_62Y7M",0.74,"M",68,62,7,null,null,"68_62Y7M",10,"M",68,62,7]
[null,"68_62Y8M",0.74299999999999999,"M",68,62,8,null,null,"68_62Y8M",10,"M",68,62,8]
[null,"68_62Y9M",0.746,"M",68,62,9,null,null,"68_62Y9M",10,"M",68,62,9]
[null,"68_62Y10M",0.749,"M",68,62,10,null,null,"68_62Y10M",10,"M",68,62,10]
[null,"68_62Y11M",0.752,"M",68,62,11,null,null,"68_62Y11M",10,"M",68,62,11]
[null,"68_63Y0M",0.75600000000000001,"M",68,63,0,null,null,"68_63Y0M",10,"M",68,63,0]
[null,"68_63Y1M",0.75900000000000001,"M",68,63,1,null,null,"68_63Y1M",10,"M",68,63,1]
[null,"68_63Y2M",0.76300000000000001,"M",68,63,2,null,null,"68_63Y2M",10,"M",68,63,2]
[null,"68_63Y3M",0.76600000000000001,"M",68,63,3,null,null,"68_63Y3M",10,"M",68,63,3]
[null,"68_63Y4M",0.77,"M",68,63,4,null,null,"68_63Y4M",10,"M",68,63,4]
[null,"68_63Y5M",0.77300000000000002,"M",68,63,5,null,null,"68_63Y5M",10,"M",68,63,5]
[null,"68_63Y6M",0.77600000000000002,"M",68,63,6,null,null,"68_63Y6M",10,"M",68,63,6]
[null,"68_63Y7M",0.78,"M",68,63,7,null,null,"68_63Y7M",10,"M",68,63,7]
[null,"68_63Y8M",0.78300000000000003,"M",68,63,8,null,null,"68_63Y8M",10,"M",68,63,8]
[null,"68_63Y9M",0.78700000000000003,"M",68,63,9,null,null,"68_63Y9M",10,"M",68,63,9]
[null,"68_63Y10M",0.79,"M",68,63,10,null,null,"68_63Y10M",10,"M",68,63,10]
[null,"68_63Y11M",0.79400000000000004,"M",68,63,11,null,null,"68_63Y11M",10,"M",68,63,11]
[null,"68_64Y0M",0.79700000000000004,"M",68,64,0,null,null,"68_64Y0M",10,"M",68,64,0]
[null,{"$f":"E1646&\"_\"&F1646&\"Y\"&G1646&\"M\"","v":"68_64Y1M"},0.80100000000000005,"M",68,64,1,null,null,"68_64Y1M",10,"M",68,64,1]
[null,"68_64Y2M",0.80500000000000005,"M",68,64,2,null,null,"68_64Y2M",10,"M",68,64,2]
[null,"68_64Y3M",0.80900000000000005,"M",68,64,3,null,null,"68_64Y3M",10,"M",68,64,3]
[null,"68_64Y4M",0.81200000000000006,"M",68,64,4,null,null,"68_64Y4M",10,"M",68,64,4]
[null,"68_64Y5M",0.81599999999999995,"M",68,64,5,null,null,"68_64Y5M",10,"M",68,64,5]
[null,"68_64Y6M",0.82,"M",68,64,6,null,null,"68_64Y6M",10,"M",68,64,6]
[null,"68_64Y7M",0.82399999999999995,"M",68,64,7,null,null,"68_64Y7M",10,"M",68,64,7]
[null,"68_64Y8M",0.82699999999999996,"M",68,64,8,null,null,"68_64Y8M",10,"M",68,64,8]
[null,"68_64Y9M",0.83099999999999996,"M",68,64,9,null,null,"68_64Y9M",10,"M",68,64,9]
[null,"68_64Y10M",0.83499999999999996,"M",68,64,10,null,null,"68_64Y10M",10,"M",68,64,10]
[null,"68_64Y11M",0.83799999999999997,"M",68,64,11,null,null,"68_64Y11M",10,"M",68,64,11]
[null,"68_65Y0M",0.84199999999999997,"M",68,65,0,null,null,"68_65Y0M",10,"M",68,65,0]
[null,"68_65Y1M",0.84599999999999997,"M",68,65,1,null,null,"68_65Y1M",10,"M",68,65,1]
[null,"68_65Y2M",0.85099999999999998,"M",68,65,2,null,null,"68_65Y2M",10,"M",68,65,2]
[null,"68_65Y3M",0.85499999999999998,"M",68,65,3,null,null,"68_65Y3M",10,"M",68,65,3]
[null,"68_65Y4M",0.85899999999999999,"M",68,65,4,null,null,"68_65Y4M",10,"M",68,65,4]
[null,"68_65Y5M",0.86299999999999999,"M",68,65,5,null,null,"68_65Y5M",10,"M",68,65,5]
[null,"68_65Y6M",0.86699999999999999,"M",68,65,6,null,null,"68_65Y6M",10,"M",68,65,6]
[null,"68_65Y7M",0.871,"M",68,65,7,null,null,"68_65Y7M",10,"M",68,65,7]
[null,"68_65Y8M",0.875,"M",68,65,8,null,null,"68_65Y8M",10,"M",68,65,8]
[null,"68_65Y9M",0.879,"M",68,65,9,null,null,"68_65Y9M",10,"M",68,65,9]
[null,"68_65Y10M",0.88300000000000001,"M",68,65,10,null,null,"68_65Y10M",10,"M",68,65,10]
[null,"68_65Y11M",0.88700000000000001,"M",68,65,11,null,null,"68_65Y11M",10,"M",68,65,11]
[null,"68_66Y0M",0.89100000000000001,"M",68,66,0,null,null,"68_66Y0M",10,"M",68,66,0]
[null,"68_66Y1M",0.89600000000000002,"M",68,66,1,null,null,"68_66Y1M",10,"M",68,66,1]
[null,"68_66Y2M",0.9,"M",68,66,2,null,null,"68_66Y2M",10,"M",68,66,2]
[null,"68_66Y3M",0.90500000000000003,"M",68,66,3,null,null,"68_66Y3M",10,"M",68,66,3]
[null,"68_66Y4M",0.90900000000000003,"M",68,66,4,null,null,"68_66Y4M",10,"M",68,66,4]
[null,"68_66Y5M",0.91300000000000003,"M",68,66,5,null,null,"68_66Y5M",10,"M",68,66,5]
[null,"68_66Y6M",0.91800000000000004,"M",68,66,6,null,null,"68_66Y6M",10,"M",68,66,6]
[null,"68_66Y7M",0.92200000000000004,"M",68,66,7,null,null,"68_66Y7M",10,"M",68,66,7]
[null,"68_66Y8M",0.92700000000000005,"M",68,66,8,null,null,"68_66Y8M",10,"M",68,66,8]
[null,"68_66Y9M",0.93100000000000005,"M",68,66,9,null,null,{"$f":"M1678&\"_\"&N1678&\"Y\"&O1678&\"M\"","v":"68_66Y9M"},10,"M",68,66,9]
[null,"68_66Y10M",0.93600000000000005,"M",68,66,10,null,null,"68_66Y10M",10,"M",68,66,10]
[null,"68_66Y11M",0.94,"M",68,66,11,null,null,"68_66Y11M",10,"M",68,66,11]
[null,"68_67Y0M",0.94499999999999995,"M",68,67,0,null,null,"68_67Y0M",10,"M",68,67,0]
[null,"68_67Y1M",0.94899999999999995,"M",68,67,1,null,null,"68_67Y1M",10,"M",68,67,1]
[null,"68_67Y2M",0.95399999999999996,"M",68,67,2,null,null,"68_67Y2M",10,"M",68,67,2]
[null,"68_67Y3M",0.95899999999999996,"M",68,67,3,null,null,"68_67Y3M",10,"M",68,67,3]
[null,"68_67Y4M",0.96399999999999997,"M",68,67,4,null,null,"68_67Y4M",10,"M",68,67,4]
[null,"68_67Y5M",0.96899999999999997,"M",68,67,5,null,null,"68_67Y5M",10,"M",68,67,5]
[null,"68_67Y6M",0.97299999999999998,"M",68,67,6,null,null,"68_67Y6M",10,"M",68,67,6]
[null,"68_67Y7M",0.97799999999999998,"M",68,67,7,null,null,"68_67Y7M",10,"M",68,67,7]
[null,"68_67Y8M",0.98299999999999998,"M",68,67,8,null,null,"68_67Y8M",10,"M",68,67,8]
[null,"68_67Y9M",0.98799999999999999,"M",68,67,9,null,null,"68_67Y9M",10,"M",68,67,9]
[null,"68_67Y10M",0.99299999999999999,"M",68,67,10,null,null,"68_67Y10M",10,"M",68,67,10]
[null,"68_67Y11M",0.995,"M",68,67,11,null,null,"68_67Y11M",10,"M",68,67,11]
[null,"68_68Y0M",1,"M",68,68,0,null,null,"68_68Y0M",10,"M",68,68,0]
[null,"68_68Y1M",1,"M",68,68,1,null,null,"68_68Y1M",10,"M",68,68,1]
[null,"68_68Y2M",1,"M",68,68,2,null,null,"68_68Y2M",10,"M",68,68,2]
[null,"68_68Y3M",1,"M",68,68,3,null,null,"68_68Y3M",10,"M",68,68,3]
[null,"68_68Y4M",1,"M",68,68,4,null,null,"68_68Y4M",10,"M",68,68,4]
[null,"68_68Y5M",1,"M",68,68,5,null,null,"68_68Y5M",10,"M",68,68,5]
[null,"68_68Y6M",1,"M",68,68,6,null,null,"68_68Y6M",10,"M",68,68,6]
[null,"68_68Y7M",1,"M",68,68,7,null,null,"68_68Y7M",10,"M",68,68,7]
[null,"68_68Y8M",1,"M",68,68,8,null,null,"68_68Y8M",10,"M",68,68,8]
[null,"68_68Y9M",1,"M",68,68,9,null,null,"68_68Y9M",10,"M",68,68,9]
[null,"68_68Y10M",1,"M",68,68,10,null,null,"68_68Y10M",10,"M",68,68,10]
[null,"68_68Y11M",1,"M",68,68,11,null,null,"68_68Y11M",10,"M",68,68,11]
[null,"68_69Y0M",1,"M",68,69,0,null,null,"68_69Y0M",10,"M",68,69,0]
[null,"68_69Y1M",1,"M",68,69,1,null,null,"68_69Y1M",10,"M",68,69,1]
[null,"68_69Y2M",1,"M",68,69,2,null,null,"68_69Y2M",10,"M",68,69,2]
[null,"68_69Y3M",1,"M",68,69,3,null,null,"68_69Y3M",10,"M",68,69,3]
[null,"68_69Y4M",1,"M",68,69,4,null,null,"68_69Y4M",10,"M",68,69,4]
[null,{"$f":"E1710&\"_\"&F1710&\"Y\"&G1710&\"M\"","v":"68_69Y5M"},1,"M",68,69,5,null,null,"68_69Y5M",10,"M",68,69,5]
[null,"68_69Y6M",1,"M",68,69,6,null,null,"68_69Y6M",10,"M",68,69,6]
[null,"68_69Y7M",1,"M",68,69,7,null,null,"68_69Y7M",10,"M",68,69,7]
[null,"68_69Y8M",1,"M",68,69,8,null,null,"68_69Y8M",10,"M",68,69,8]
[null,"68_69Y9M",1,"M",68,69,9,null,null,"68_69Y9M",10,"M",68,69,9]
[null,"68_69Y10M",1,"M",68,69,10,null,null,"68_69Y10M",10,"M",68,69,10]
[null,"68_69Y11M",1,"M",68,69,11,null,null,"68_69Y11M",10,"M",68,69,11]
[null,"68_70Y0M",1,"M",68,70,0,null,null,"68_70Y0M",10,"M",68,70,0]
[null,"68_70Y1M",1,"M",68,70,1,null,null,"68_70Y1M",10,"M",68,70,1]
[null,"68_70Y2M",1,"M",68,70,2,null,null,"68_70Y2M",10,"M",68,70,2]
[null,"68_70Y3M",1,"M",68,70,3,null,null,"68_70Y3M",10,"M",68,70,3]
[null,"68_70Y4M",1,"M",68,70,4,null,null,"68_70Y4M",10,"M",68,70,4]
[null,"68_70Y5M",1,"M",68,70,5,null,null,"68_70Y5M",10,"M",68,70,5]
[null,"68_70Y6M",1,"M",68,70,6,null,null,"68_70Y6M",10,"M",68,70,6]
[null,"68_70Y7M",1,"M",68,70,7,null,null,"68_70Y7M",10,"M",68,70,7]
[null,"68_70Y8M",1,"M",68,70,8,null,null,"68_70Y8M",10,"M",68,70,8]
[null,"68_70Y9M",1,"M",68,70,9,null,null,"68_70Y9M",10,"M",68,70,9]
[null,"68_70Y10M",1,"M",68,70,10,null,null,"68_70Y10M",10,"M",68,70,10]
[null,"68_70Y11M",1,"M",68,70,11,null,null,"68_70Y11M",10,"M",68,70,11]
[null,"68_71Y0M",1,"M",68,71,0,null,null,"68_71Y0M",10,"M",68,71,0]
[null,"68_71Y1M",1,"M",68,71,1,null,null,"68_71Y1M",10,"M",68,71,1]
[null,"68_71Y2M",1,"M",68,71,2,null,null,"68_71Y2M",10,"M",68,71,2]
[null,"68_71Y3M",1,"M",68,71,3,null,null,"68_71Y3M",10,"M",68,71,3]
[null,"68_71Y4M",1,"M",68,71,4,null,null,"68_71Y4M",10,"M",68,71,4]
[null,"68_71Y5M",1,"M",68,71,5,null,null,"68_71Y5M",10,"M",68,71,5]
[null,"68_71Y6M",1,"M",68,71,6,null,null,"68_71Y6M",10,"M",68,71,6]
[null,"68_71Y7M",1,"M",68,71,7,null,null,"68_71Y7M",10,"M",68,71,7]
[null,"68_71Y8M",1,"M",68,71,8,null,null,"68_71Y8M",10,"M",68,71,8]
[null,"68_71Y9M",1,"M",68,71,9,null,null,"68_71Y9M",10,"M",68,71,9]
[null,"68_71Y10M",1,"M",68,71,10,null,null,"68_71Y10M",10,"M",68,71,10]
[null,"68_71Y11M",1,"M",68,71,11,null,null,"68_71Y11M",10,"M",68,71,11]
[null,"68_72Y0M",1,"M",68,72,0,null,null,"68_72Y0M",10,"M",68,72,0]
[null,"68_72Y1M",1,"M",68,72,1,null,null,{"$f":"M1742&\"_\"&N1742&\"Y\"&O1742&\"M\"","v":"68_72Y1M"},10,"M",68,72,1]
[null,"68_72Y2M",1,"M",68,72,2,null,null,"68_72Y2M",10,"M",68,72,2]
[null,"68_72Y3M",1,"M",68,72,3,null,null,"68_72Y3M",10,"M",68,72,3]
[null,"68_72Y4M",1,"M",68,72,4,null,null,"68_72Y4M",10,"M",68,72,4]
[null,"68_72Y5M",1,"M",68,72,5,null,null,"68_72Y5M",10,"M",68,72,5]
[null,"68_72Y6M",1,"M",68,72,6,null,null,"68_72Y6M",10,"M",68,72,6]
[null,"68_72Y7M",1,"M",68,72,7,null,null,"68_72Y7M",10,"M",68,72,7]
[null,"68_72Y8M",1,"M",68,72,8,null,null,"68_72Y8M",10,"M",68,72,8]
[null,"68_72Y9M",1,"M",68,72,9,null,null,"68_72Y9M",10,"M",68,72,9]
[null,"68_72Y10M",1,"M",68,72,10,null,null,"68_72Y10M",10,"M",68,72,10]
[null,"68_72Y11M",1,"M",68,72,11,null,null,"68_72Y11M",10,"M",68,72,11]
[null,"68_73Y0M",1,"M",68,73,0,null,null,"68_73Y0M",10,"M",68,73,0]
[null,"68_73Y1M",1,"M",68,73,1,null,null,"68_73Y1M",10,"M",68,73,1]
[null,"68_73Y2M",1,"M",68,73,2,null,null,"68_73Y2M",10,"M",68,73,2]
[null,"68_73Y3M",1,"M",68,73,3,null,null,"68_73Y3M",10,"M",68,73,3]
[null,"68_73Y4M",1,"M",68,73,4,null,null,"68_73Y4M",10,"M",68,73,4]
[null,"68_73Y5M",1,"M",68,73,5,null,null,"68_73Y5M",10,"M",68,73,5]
[null,"68_73Y6M",1,"M",68,73,6,null,null,"68_73Y6M",10,"M",68,73,6]
[null,"68_73Y7M",1,"M",68,73,7,null,null,"68_73Y7M",10,"M",68,73,7]
[null,"68_73Y8M",1,"M",68,73,8,null,null,"68_73Y8M",10,"M",68,73,8]
[null,"68_73Y9M",1,"M",68,73,9,null,null,"68_73Y9M",10,"M",68,73,9]
[null,"68_73Y10M",1,"M",68,73,10,null,null,"68_73Y10M",10,"M",68,73,10]
[null,"68_73Y11M",1,"M",68,73,11,null,null,"68_73Y11M",10,"M",68,73,11]
[null,"68_74Y0M",1,"M",68,74,0,null,null,"68_74Y0M",10,"M",68,74,0]
[null,"68_74Y1M",1,"M",68,74,1,null,null,"68_74Y1M",10,"M",68,74,1]
[null,"68_74Y2M",1,"M",68,74,2,null,null,"68_74Y2M",10,"M",68,74,2]
[null,"68_74Y3M",1,"M",68,74,3,null,null,"68_74Y3M",10,"M",68,74,3]
[null,"68_74Y4M",1,"M",68,74,4,null,null,"68_74Y4M",10,"M",68,74,4]
[null,"68_74Y5M",1,"M",68,74,5,null,null,"68_74Y5M",10,"M",68,74,5]
[null,"68_74Y6M",1,"M",68,74,6,null,null,"68_74Y6M",10,"M",68,74,6]
[null,"68_74Y7M",1,"M",68,74,7,null,null,"68_74Y7M",10,"M",68,74,7]
[null,"68_74Y8M",1,"M",68,74,8,null,null,"68_74Y8M",10,"M",68,74,8]
[null,{"$f":"E1774&\"_\"&F1774&\"Y\"&G1774&\"M\"","v":"68_74Y9M"},1,"M",68,74,9,null,null,"68_74Y9M",10,"M",68,74,9]
[null,"68_74Y10M",1,"M",68,74,10,null,null,"68_74Y10M",10,"M",68,74,10]
[null,"68_74Y11M",1,"M",68,74,11,null,null,"68_74Y11M",10,"M",68,74,11]
[null,"68_54Y0M",0.49099999999999999,"F",68,54,0,null,null,"68_54Y0M",10,"F",68,54,0]
[null,"68_54Y1M",0.49299999999999999,"F",68,54,1,null,null,"68_54Y1M",10,"F",68,54,1]
[null,"68_54Y2M",0.495,"F",68,54,2,null,null,"68_54Y2M",10,"F",68,54,2]
[null,"68_54Y3M",0.496,"F",68,54,3,null,null,"68_54Y3M",10,"F",68,54,3]
[null,"68_54Y4M",0.498,"F",68,54,4,null,null,"68_54Y4M",10,"F",68,54,4]
[null,"68_54Y5M",0.5,"F",68,54,5,null,null,"68_54Y5M",10,"F",68,54,5]
[null,"68_54Y6M",0.502,"F",68,54,6,null,null,"68_54Y6M",10,"F",68,54,6]
[null,"68_54Y7M",0.504,"F",68,54,7,null,null,"68_54Y7M",10,"F",68,54,7]
[null,"68_54Y8M",0.50600000000000001,"F",68,54,8,null,null,"68_54Y8M",10,"F",68,54,8]
[null,"68_54Y9M",0.50800000000000001,"F",68,54,9,null,null,"68_54Y9M",10,"F",68,54,9]
[null,"68_54Y10M",0.50900000000000001,"F",68,54,10,null,null,"68_54Y10M",10,"F",68,54,10]
[null,"68_54Y11M",0.51100000000000001,"F",68,54,11,null,null,"68_54Y11M",10,"F",68,54,11]
[null,"68_55Y0M",0.51300000000000001,"F",68,55,0,null,null,"68_55Y0M",10,"F",68,55,0]
[null,"68_55Y1M",0.51500000000000001,"F",68,55,1,null,null,"68_55Y1M",10,"F",68,55,1]
[null,"68_55Y2M",0.51700000000000002,"F",68,55,2,null,null,"68_55Y2M",10,"F",68,55,2]
[null,"68_55Y3M",0.51900000000000002,"F",68,55,3,null,null,"68_55Y3M",10,"F",68,55,3]
[null,"68_55Y4M",0.52100000000000002,"F",68,55,4,null,null,"68_55Y4M",10,"F",68,55,4]
[null,"68_55Y5M",0.52300000000000002,"F",68,55,5,null,null,"68_55Y5M",10,"F",68,55,5]
[null,"68_55Y6M",0.52500000000000002,"F",68,55,6,null,null,"68_55Y6M",10,"F",68,55,6]
[null,"68_55Y7M",0.52700000000000002,"F",68,55,7,null,null,"68_55Y7M",10,"F",68,55,7]
[null,"68_55Y8M",0.52900000000000003,"F",68,55,8,null,null,"68_55Y8M",10,"F",68,55,8]
[null,"68_55Y9M",0.53100000000000003,"F",68,55,9,null,null,"68_55Y9M",10,"F",68,55,9]
[null,"68_55Y10M",0.53300000000000003,"F",68,55,10,null,null,"68_55Y10M",10,"F",68,55,10]
[null,"68_55Y11M",0.53500000000000003,"F",68,55,11,null,null,"68_55Y11M",10,"F",68,55,11]
[null,"68_56Y0M",0.53700000000000003,"F",68,56,0,null,null,"68_56Y0M",10,"F",68,56,0]
[null,"68_56Y1M",0.53900000000000003,"F",68,56,1,null,null,"68_56Y1M",10,"F",68,56,1]
[null,"68_56Y2M",0.54100000000000004,"F",68,56,2,null,null,"68_56Y2M",10,"F",68,56,2]
[null,"68_56Y3M",0.54300000000000004,"F",68,56,3,null,null,"68_56Y3M",10,"F",68,56,3]
[null,"68_56Y4M",0.54500000000000004,"F",68,56,4,null,null,"68_56Y4M",10,"F",68,56,4]
[null,"68_56Y5M",0.54700000000000004,"F",68,56,5,null,null,{"$f":"M1806&\"_\"&N1806&\"Y\"&O1806&\"M\"","v":"68_56Y5M"},10,"F",68,56,5]
[null,"68_56Y6M",0.54900000000000004,"F",68,56,6,null,null,"68_56Y6M",10,"F",68,56,6]
[null,"68_56Y7M",0.55100000000000005,"F",68,56,7,null,null,"68_56Y7M",10,"F",68,56,7]
[null,"68_56Y8M",0.55300000000000005,"F",68,56,8,null,null,"68_56Y8M",10,"F",68,56,8]
[null,"68_56Y9M",0.55600000000000005,"F",68,56,9,null,null,"68_56Y9M",10,"F",68,56,9]
[null,"68_56Y10M",0.55800000000000005,"F",68,56,10,null,null,"68_56Y10M",10,"F",68,56,10]
[null,"68_56Y11M",0.56000000000000005,"F",68,56,11,null,null,"68_56Y11M",10,"F",68,56,11]
[null,"68_57Y0M",0.56200000000000006,"F",68,57,0,null,null,"68_57Y0M",10,"F",68,57,0]
[null,"68_57Y1M",0.56399999999999995,"F",68,57,1,null,null,"68_57Y1M",10,"F",68,57,1]
[null,"68_57Y2M",0.56599999999999995,"F",68,57,2,null,null,"68_57Y2M",10,"F",68,57,2]
[null,"68_57Y3M",0.56899999999999995,"F",68,57,3,null,null,"68_57Y3M",10,"F",68,57,3]
[null,"68_57Y4M",0.57099999999999995,"F",68,57,4,null,null,"68_57Y4M",10,"F",68,57,4]
[null,"68_57Y5M",0.57299999999999995,"F",68,57,5,null,null,"68_57Y5M",10,"F",68,57,5]
[null,"68_57Y6M",0.57499999999999996,"F",68,57,6,null,null,"68_57Y6M",10,"F",68,57,6]
[null,"68_57Y7M",0.57799999999999996,"F",68,57,7,null,null,"68_57Y7M",10,"F",68,57,7]
[null,"68_57Y8M",0.57999999999999996,"F",68,57,8,null,null,"68_57Y8M",10,"F",68,57,8]
[null,"68_57Y9M",0.58199999999999996,"F",68,57,9,null,null,"68_57Y9M",10,"F",68,57,9]
[null,"68_57Y10M",0.58399999999999996,"F",68,57,10,null,null,"68_57Y10M",10,"F",68,57,10]
[null,"68_57Y11M",0.58599999999999997,"F",68,57,11,null,null,"68_57Y11M",10,"F",68,57,11]
[null,"68_58Y0M",0.58899999999999997,"F",68,58,0,null,null,"68_58Y0M",10,"F",68,58,0]
[null,"68_58Y1M",0.59099999999999997,"F",68,58,1,null,null,"68_58Y1M",10,"F",68,58,1]
[null,"68_58Y2M",0.59399999999999997,"F",68,58,2,null,null,"68_58Y2M",10,"F",68,58,2]
[null,"68_58Y3M",0.59599999999999997,"F",68,58,3,null,null,"68_58Y3M",10,"F",68,58,3]
[null,"68_58Y4M",0.59799999999999998,"F",68,58,4,null,null,"68_58Y4M",10,"F",68,58,4]
[null,"68_58Y5M",0.60099999999999998,"F",68,58,5,null,null,"68_58Y5M",10,"F",68,58,5]
[null,"68_58Y6M",0.60299999999999998,"F",68,58,6,null,null,"68_58Y6M",10,"F",68,58,6]
[null,"68_58Y7M",0.60499999999999998,"F",68,58,7,null,null,"68_58Y7M",10,"F",68,58,7]
[null,"68_58Y8M",0.60799999999999998,"F",68,58,8,null,null,"68_58Y8M",10,"F",68,58,8]
[null,"68_58Y9M",0.61,"F",68,58,9,null,null,"68_58Y9M",10,"F",68,58,9]
[null,"68_58Y10M",0.61299999999999999,"F",68,58,10,null,null,"68_58Y10M",10,"F",68,58,10]
[null,"68_58Y11M",0.61499999999999999,"F",68,58,11,null,null,"68_58Y11M",10,"F",68,58,11]
[null,"68_59Y0M",0.61799999999999999,"F",68,59,0,null,null,"68_59Y0M",10,"F",68,59,0]
[null,{"$f":"E1838&\"_\"&F1838&\"Y\"&G1838&\"M\"","v":"68_59Y1M"},0.62,"F",68,59,1,null,null,"68_59Y1M",10,"F",68,59,1]
[null,"68_59Y2M",0.623,"F",68,59,2,null,null,"68_59Y2M",10,"F",68,59,2]
[null,"68_59Y3M",0.625,"F",68,59,3,null,null,"68_59Y3M",10,"F",68,59,3]
[null,"68_59Y4M",0.628,"F",68,59,4,null,null,"68_59Y4M",10,"F",68,59,4]
[null,"68_59Y5M",0.63,"F",68,59,5,null,null,"68_59Y5M",10,"F",68,59,5]
[null,"68_59Y6M",0.63300000000000001,"F",68,59,6,null,null,"68_59Y6M",10,"F",68,59,6]
[null,"68_59Y7M",0.63500000000000001,"F",68,59,7,null,null,"68_59Y7M",10,"F",68,59,7]
[null,"68_59Y8M",0.63800000000000001,"F",68,59,8,null,null,"68_59Y8M",10,"F",68,59,8]
[null,"68_59Y9M",0.64100000000000001,"F",68,59,9,null,null,"68_59Y9M",10,"F",68,59,9]
[null,"68_59Y10M",0.64300000000000002,"F",68,59,10,null,null,"68_59Y10M",10,"F",68,59,10]
[null,"68_59Y11M",0.64600000000000002,"F",68,59,11,null,null,"68_59Y11M",10,"F",68,59,11]
[null,"68_60Y0M",0.64800000000000002,"F",68,60,0,null,null,"68_60Y0M",10,"F",68,60,0]
[null,"68_60Y1M",0.65100000000000002,"F",68,60,1,null,null,"68_60Y1M",10,"F",68,60,1]
[null,"68_60Y2M",0.65400000000000003,"F",68,60,2,null,null,"68_60Y2M",10,"F",68,60,2]
[null,"68_60Y3M",0.65700000000000003,"F",68,60,3,null,null,"68_60Y3M",10,"F",68,60,3]
[null,"68_60Y4M",0.65900000000000003,"F",68,60,4,null,null,"68_60Y4M",10,"F",68,60,4]
[null,"68_60Y5M",0.66200000000000003,"F",68,60,5,null,null,"68_60Y5M",10,"F",68,60,5]
[null,"68_60Y6M",0.66500000000000004,"F",68,60,6,null,null,"68_60Y6M",10,"F",68,60,6]
[null,"68_60Y7M",0.66800000000000004,"F",68,60,7,null,null,"68_60Y7M",10,"F",68,60,7]
[null,"68_60Y8M",0.67,"F",68,60,8,null,null,"68_60Y8M",10,"F",68,60,8]
[null,"68_60Y9M",0.67300000000000004,"F",68,60,9,null,null,"68_60Y9M",10,"F",68,60,9]
[null,"68_60Y10M",0.67600000000000005,"F",68,60,10,null,null,"68_60Y10M",10,"F",68,60,10]
[null,"68_60Y11M",0.67900000000000005,"F",68,60,11,null,null,"68_60Y11M",10,"F",68,60,11]
[null,"68_61Y0M",0.68200000000000005,"F",68,61,0,null,null,"68_61Y0M",10,"F",68,61,0]
[null,"68_61Y1M",0.68500000000000005,"F",68,61,1,null,null,"68_61Y1M",10,"F",68,61,1]
[null,"68_61Y2M",0.68700000000000006,"F",68,61,2,null,null,"68_61Y2M",10,"F",68,61,2]
[null,"68_61Y3M",0.69,"F",68,61,3,null,null,"68_61Y3M",10,"F",68,61,3]
[null,"68_61Y4M",0.69299999999999995,"F",68,61,4,null,null,"68_61Y4M",10,"F",68,61,4]
[null,"68_61Y5M",0.69599999999999995,"F",68,61,5,null,null,"68_61Y5M",10,"F",68,61,5]
[null,"68_61Y6M",0.69899999999999995,"F",68,61,6,null,null,"68_61Y6M",10,"F",68,61,6]
[null,"68_61Y7M",0.70199999999999996,"F",68,61,7,null,null,"68_61Y7M",10,"F",68,61,7]
[null,"68_61Y8M",0.70499999999999996,"F",68,61,8,null,null,"68_61Y8M",10,"F",68,61,8]
[null,"68_61Y9M",0.70799999999999996,"F",68,61,9,null,null,{"$f":"M1870&\"_\"&N1870&\"Y\"&O1870&\"M\"","v":"68_61Y9M"},10,"F",68,61,9]
[null,"68_61Y10M",0.71099999999999997,"F",68,61,10,null,null,"68_61Y10M",10,"F",68,61,10]
[null,"68_61Y11M",0.71399999999999997,"F",68,61,11,null,null,"68_61Y11M",10,"F",68,61,11]
[null,"68_62Y0M",0.71699999999999997,"F",68,62,0,null,null,"68_62Y0M",10,"F",68,62,0]
[null,"68_62Y1M",0.72,"F",68,62,1,null,null,"68_62Y1M",10,"F",68,62,1]
[null,"68_62Y2M",0.72399999999999998,"F",68,62,2,null,null,"68_62Y2M",10,"F",68,62,2]
[null,"68_62Y3M",0.72699999999999998,"F",68,62,3,null,null,"68_62Y3M",10,"F",68,62,3]
[null,"68_62Y4M",0.73,"F",68,62,4,null,null,"68_62Y4M",10,"F",68,62,4]
[null,"68_62Y5M",0.73299999999999998,"F",68,62,5,null,null,"68_62Y5M",10,"F",68,62,5]
[null,"68_62Y6M",0.73599999999999999,"F",68,62,6,null,null,"68_62Y6M",10,"F",68,62,6]
[null,"68_62Y7M",0.74,"F",68,62,7,null,null,"68_62Y7M",10,"F",68,62,7]
[null,"68_62Y8M",0.74299999999999999,"F",68,62,8,null,null,"68_62Y8M",10,"F",68,62,8]
[null,"68_62Y9M",0.746,"F",68,62,9,null,null,"68_62Y9M",10,"F",68,62,9]
[null,"68_62Y10M",0.749,"F",68,62,10,null,null,"68_62Y10M",10,"F",68,62,10]
[null,"68_62Y11M",0.752,"F",68,62,11,null,null,"68_62Y11M",10,"F",68,62,11]
[null,"68_63Y0M",0.75600000000000001,"F",68,63,0,null,null,"68_63Y0M",10,"F",68,63,0]
[null,"68_63Y1M",0.75900000000000001,"F",68,63,1,null,null,"68_63Y1M",10,"F",68,63,1]
[null,"68_63Y2M",0.76300000000000001,"F",68,63,2,null,null,"68_63Y2M",10,"F",68,63,2]
[null,"68_63Y3M",0.76600000000000001,"F",68,63,3,null,null,"68_63Y3M",10,"F",68,63,3]
[null,"68_63Y4M",0.77,"F",68,63,4,null,null,"68_63Y4M",10,"F",68,63,4]
[null,"68_63Y5M",0.77300000000000002,"F",68,63,5,null,null,"68_63Y5M",10,"F",68,63,5]
[null,"68_63Y6M",0.77600000000000002,"F",68,63,6,null,null,"68_63Y6M",10,"F",68,63,6]
[null,"68_63Y7M",0.78,"F",68,63,7,null,null,"68_63Y7M",10,"F",68,63,7]
[null,"68_63Y8M",0.78300000000000003,"F",68,63,8,null,null,"68_63Y8M",10,"F",68,63,8]
[null,"68_63Y9M",0.78700000000000003,"F",68,63,9,null,null,"68_63Y9M",10,"F",68,63,9]
[null,"68_63Y10M",0.79,"F",68,63,10,null,null,"68_63Y10M",10,"F",68,63,10]
[null,"68_63Y11M",0.79400000000000004,"F",68,63,11,null,null,"68_63Y11M",10,"F",68,63,11]
[null,"68_64Y0M",0.79700000000000004,"F",68,64,0,null,null,"68_64Y0M",10,"F",68,64,0]
[null,"68_64Y1M",0.80100000000000005,"F",68,64,1,null,null,"68_64Y1M",10,"F",68,64,1]
[null,"68_64Y2M",0.80500000000000005,"F",68,64,2,null,null,"68_64Y2M",10,"F",68,64,2]
[null,"68_64Y3M",0.80900000000000005,"F",68,64,3,null,null,"68_64Y3M",10,"F",68,64,3]
[null,"68_64Y4M",0.81200000000000006,"F",68,64,4,null,null,"68_64Y4M",10,"F",68,64,4]
[null,{"$f":"E1902&\"_\"&F1902&\"Y\"&G1902&\"M\"","v":"68_64Y5M"},0.81599999999999995,"F",68,64,5,null,null,"68_64Y5M",10,"F",68,64,5]
[null,"68_64Y6M",0.82,"F",68,64,6,null,null,"68_64Y6M",10,"F",68,64,6]
[null,"68_64Y7M",0.82399999999999995,"F",68,64,7,null,null,"68_64Y7M",10,"F",68,64,7]
[null,"68_64Y8M",0.82699999999999996,"F",68,64,8,null,null,"68_64Y8M",10,"F",68,64,8]
[null,"68_64Y9M",0.83099999999999996,"F",68,64,9,null,null,"68_64Y9M",10,"F",68,64,9]
[null,"68_64Y10M",0.83499999999999996,"F",68,64,10,null,null,"68_64Y10M",10,"F",68,64,10]
[null,"68_64Y11M",0.83799999999999997,"F",68,64,11,null,null,"68_64Y11M",10,"F",68,64,11]
[null,"68_65Y0M",0.84199999999999997,"F",68,65,0,null,null,"68_65Y0M",10,"F",68,65,0]
[null,"68_65Y1M",0.84599999999999997,"F",68,65,1,null,null,"68_65Y1M",10,"F",68,65,1]
[null,"68_65Y2M",0.85099999999999998,"F",68,65,2,null,null,"68_65Y2M",10,"F",68,65,2]
[null,"68_65Y3M",0.85499999999999998,"F",68,65,3,null,null,"68_65Y3M",10,"F",68,65,3]
[null,"68_65Y4M",0.85899999999999999,"F",68,65,4,null,null,"68_65Y4M",10,"F",68,65,4]
[null,"68_65Y5M",0.86299999999999999,"F",68,65,5,null,null,"68_65Y5M",10,"F",68,65,5]
[null,"68_65Y6M",0.86699999999999999,"F",68,65,6,null,null,"68_65Y6M",10,"F",68,65,6]
[null,"68_65Y7M",0.871,"F",68,65,7,null,null,"68_65Y7M",10,"F",68,65,7]
[null,"68_65Y8M",0.875,"F",68,65,8,null,null,"68_65Y8M",10,"F",68,65,8]
[null,"68_65Y9M",0.879,"F",68,65,9,null,null,"68_65Y9M",10,"F",68,65,9]
[null,"68_65Y10M",0.88300000000000001,"F",68,65,10,null,null,"68_65Y10M",10,"F",68,65,10]
[null,"68_65Y11M",0.88700000000000001,"F",68,65,11,null,null,"68_65Y11M",10,"F",68,65,11]
[null,"68_66Y0M",0.89100000000000001,"F",68,66,0,null,null,"68_66Y0M",10,"F",68,66,0]
[null,"68_66Y1M",0.89600000000000002,"F",68,66,1,null,null,"68_66Y1M",10,"F",68,66,1]
[null,"68_66Y2M",0.9,"F",68,66,2,null,null,"68_66Y2M",10,"F",68,66,2]
[null,"68_66Y3M",0.90500000000000003,"F",68,66,3,null,null,"68_66Y3M",10,"F",68,66,3]
[null,"68_66Y4M",0.90900000000000003,"F",68,66,4,null,null,"68_66Y4M",10,"F",68,66,4]
[null,"68_66Y5M",0.91300000000000003,"F",68,66,5,null,null,"68_66Y5M",10,"F",68,66,5]
[null,"68_66Y6M",0.91800000000000004,"F",68,66,6,null,null,"68_66Y6M",10,"F",68,66,6]
[null,"68_66Y7M",0.92200000000000004,"F",68,66,7,null,null,"68_66Y7M",10,"F",68,66,7]
[null,"68_66Y8M",0.92700000000000005,"F",68,66,8,null,null,"68_66Y8M",10,"F",68,66,8]
[null,"68_66Y9M",0.93100000000000005,"F",68,66,9,null,null,"68_66Y9M",10,"F",68,66,9]
[null,"68_66Y10M",0.93600000000000005,"F",68,66,10,null,null,"68_66Y10M",10,"F",68,66,10]
[null,"68_66Y11M",0.94,"F",68,66,11,null,null,"68_66Y11M",10,"F",68,66,11]
[null,"68_67Y0M",0.94499999999999995,"F",68,67,0,null,null,"68_67Y0M",10,"F",68,67,0]
[null,"68_67Y1M",0.94899999999999995,"F",68,67,1,null,null,{"$f":"M1934&\"_\"&N1934&\"Y\"&O1934&\"M\"","v":"68_67Y1M"},10,"F",68,67,1]
[null,"68_67Y2M",0.95399999999999996,"F",68,67,2,null,null,"68_67Y2M",10,"F",68,67,2]
[null,"68_67Y3M",0.95899999999999996,"F",68,67,3,null,null,"68_67Y3M",10,"F",68,67,3]
[null,"68_67Y4M",0.96399999999999997,"F",68,67,4,null,null,"68_67Y4M",10,"F",68,67,4]
[null,"68_67Y5M",0.96899999999999997,"F",68,67,5,null,null,"68_67Y5M",10,"F",68,67,5]
[null,"68_67Y6M",0.97299999999999998,"F",68,67,6,null,null,"68_67Y6M",10,"F",68,67,6]
[null,"68_67Y7M",0.97799999999999998,"F",68,67,7,null,null,"68_67Y7M",10,"F",68,67,7]
[null,"68_67Y8M",0.98299999999999998,"F",68,67,8,null,null,"68_67Y8M",10,"F",68,67,8]
[null,"68_67Y9M",0.98799999999999999,"F",68,67,9,null,null,"68_67Y9M",10,"F",68,67,9]
[null,"68_67Y10M",0.99299999999999999,"F",68,67,10,null,null,"68_67Y10M",10,"F",68,67,10]
[null,"68_67Y11M",0.995,"F",68,67,11,null,null,"68_67Y11M",10,"F",68,67,11]
[null,"68_68Y0M",1,"F",68,68,0,null,null,"68_68Y0M",10,"F",68,68,0]
[null,"68_68Y1M",1,"F",68,68,1,null,null,"68_68Y1M",10,"F",68,68,1]
[null,"68_68Y2M",1,"F",68,68,2,null,null,"68_68Y2M",10,"F",68,68,2]
[null,"68_68Y3M",1,"F",68,68,3,null,null,"68_68Y3M",10,"F",68,68,3]
[null,"68_68Y4M",1,"F",68,68,4,null,null,"68_68Y4M",10,"F",68,68,4]
[null,"68_68Y5M",1,"F",68,68,5,null,null,"68_68Y5M",10,"F",68,68,5]
[null,"68_68Y6M",1,"F",68,68,6,null,null,"68_68Y6M",10,"F",68,68,6]
[null,"68_68Y7M",1,"F",68,68,7,null,null,"68_68Y7M",10,"F",68,68,7]
[null,"68_68Y8M",1,"F",68,68,8,null,null,"68_68Y8M",10,"F",68,68,8]
[null,"68_68Y9M",1,"F",68,68,9,null,null,"68_68Y9M",10,"F",68,68,9]
[null,"68_68Y10M",1,"F",68,68,10,null,null,"68_68Y10M",10,"F",68,68,10]
[null,"68_68Y11M",1,"F",68,68,11,null,null,"68_68Y11M",10,"F",68,68,11]
[null,"68_69Y0M",1,"F",68,69,0,null,null,"68_69Y0M",10,"F",68,69,0]
[null,"68_69Y1M",1,"F",68,69,1,null,null,"68_69Y1M",10,"F",68,69,1]
[null,"68_69Y2M",1,"F",68,69,2,null,null,"68_69Y2M",10,"F",68,69,2]
[null,"68_69Y3M",1,"F",68,69,3,null,null,"68_69Y3M",10,"F",68,69,3]
[null,"68_69Y4M",1,"F",68,69,4,null,null,"68_69Y4M",10,"F",68,69,4]
[null,"68_69Y5M",1,"F",68,69,5,null,null,"68_69Y5M",10,"F",68,69,5]
[null,"68_69Y6M",1,"F",68,69,6,null,null,"68_69Y6M",10,"F",68,69,6]
[null,"68_69Y7M",1,"F",68,69,7,null,null,"68_69Y7M",10,"F",68,69,7]
[null,"68_69Y8M",1,"F",68,69,8,null,null,"68_69Y8M",10,"F",68,69,8]
[null,{"$f":"E1966&\"_\"&F1966&\"Y\"&G1966&\"M\"","v":"68_69Y9M"},1,"F",68,69,9,null,null,"68_69Y9M",10,"F",68,69,9]
[null,"68_69Y10M",1,"F",68,69,10,null,null,"68_69Y10M",10,"F",68,69,10]
[null,"68_69Y11M",1,"F",68,69,11,null,null,"68_69Y11M",10,"F",68,69,11]
[null,"68_70Y0M",1,"F",68,70,0,null,null,"68_70Y0M",10,"F",68,70,0]
[null,"68_70Y1M",1,"F",68,70,1,null,null,"68_70Y1M",10,"F",68,70,1]
[null,"68_70Y2M",1,"F",68,70,2,null,null,"68_70Y2M",10,"F",68,70,2]
[null,"68_70Y3M",1,"F",68,70,3,null,null,"68_70Y3M",10,"F",68,70,3]
[null,"68_70Y4M",1,"F",68,70,4,null,null,"68_70Y4M",10,"F",68,70,4]
[null,"68_70Y5M",1,"F",68,70,5,null,null,"68_70Y5M",10,"F",68,70,5]
[null,"68_70Y6M",1,"F",68,70,6,null,null,"68_70Y6M",10,"F",68,70,6]
[null,"68_70Y7M",1,"F",68,70,7,null,null,"68_70Y7M",10,"F",68,70,7]
[null,"68_70Y8M",1,"F",68,70,8,null,null,"68_70Y8M",10,"F",68,70,8]
[null,"68_70Y9M",1,"F",68,70,9,null,null,"68_70Y9M",10,"F",68,70,9]
[null,"68_70Y10M",1,"F",68,70,10,null,null,"68_70Y10M",10,"F",68,70,10]
[null,"68_70Y11M",1,"F",68,70,11,null,null,"68_70Y11M",10,"F",68,70,11]
[null,"68_71Y0M",1,"F",68,71,0,null,null,"68_71Y0M",10,"F",68,71,0]
[null,"68_71Y1M",1,"F",68,71,1,null,null,"68_71Y1M",10,"F",68,71,1]
[null,"68_71Y2M",1,"F",68,71,2,null,null,"68_71Y2M",10,"F",68,71,2]
[null,"68_71Y3M",1,"F",68,71,3,null,null,"68_71Y3M",10,"F",68,71,3]
[null,"68_71Y4M",1,"F",68,71,4,null,null,"68_71Y4M",10,"F",68,71,4]
[null,"68_71Y5M",1,"F",68,71,5,null,null,"68_71Y5M",10,"F",68,71,5]
[null,"68_71Y6M",1,"F",68,71,6,null,null,"68_71Y6M",10,"F",68,71,6]
[null,"68_71Y7M",1,"F",68,71,7,null,null,"68_71Y7M",10,"F",68,71,7]
[null,"68_71Y8M",1,"F",68,71,8,null,null,"68_71Y8M",10,"F",68,71,8]
[null,"68_71Y9M",1,"F",68,71,9,null,null,"68_71Y9M",10,"F",68,71,9]
[null,"68_71Y10M",1,"F",68,71,10,null,null,"68_71Y10M",10,"F",68,71,10]
[null,"68_71Y11M",1,"F",68,71,11,null,null,"68_71Y11M",10,"F",68,71,11]
[null,"68_72Y0M",1,"F",68,72,0,null,null,"68_72Y0M",10,"F",68,72,0]
[null,"68_72Y1M",1,"F",68,72,1,null,null,"68_72Y1M",10,"F",68,72,1]
[null,"68_72Y2M",1,"F",68,72,2,null,null,"68_72Y2M",10,"F",68,72,2]
[null,"68_72Y3M",1,"F",68,72,3,null,null,"68_72Y3M",10,"F",68,72,3]
[null,"68_72Y4M",1,"F",68,72,4,null,null,"68_72Y4M",10,"F",68,72,4]
[null,"68_72Y5M",1,"F",68,72,5,null,null,{"$f":"M1998&\"_\"&N1998&\"Y\"&O1998&\"M\"","v":"68_72Y5M"},10,"F",68,72,5]
[null,"68_72Y6M",1,"F",68,72,6,null,null,"68_72Y6M",10,"F",68,72,6]
[null,"68_72Y7M",1,"F",68,72,7,null,null,"68_72Y7M",10,"F",68,72,7]
[null,"68_72Y8M",1,"F",68,72,8,null,null,"68_72Y8M",10,"F",68,72,8]
[null,"68_72Y9M",1,"F",68,72,9,null,null,"68_72Y9M",10,"F",68,72,9]
[null,"68_72Y10M",1,"F",68,72,10,null,null,"68_72Y10M",10,"F",68,72,10]
[null,"68_72Y11M",1,"F",68,72,11,null,null,"68_72Y11M",10,"F",68,72,11]
[null,"68_73Y0M",1,"F",68,73,0,null,null,"68_73Y0M",10,"F",68,73,0]
[null,"68_73Y1M",1,"F",68,73,1,null,null,"68_73Y1M",10,"F",68,73,1]
[null,"68_73Y2M",1,"F",68,73,2,null,null,"68_73Y2M",10,"F",68,73,2]
[null,"68_73Y3M",1,"F",68,73,3,null,null,"68_73Y3M",10,"F",68,73,3]
[null,"68_73Y4M",1,"F",68,73,4,null,null,"68_73Y4M",10,"F",68,73,4]
[null,"68_73Y5M",1,"F",68,73,5,null,null,"68_73Y5M",10,"F",68,73,5]
[null,"68_73Y6M",1,"F",68,73,6,null,null,"68_73Y6M",10,"F",68,73,6]
[null,"68_73Y7M",1,"F",68,73,7,null,null,"68_73Y7M",10,"F",68,73,7]
[null,"68_73Y8M",1,"F",68,73,8,null,null,"68_73Y8M",10,"F",68,73,8]
[null,"68_73Y9M",1,"F",68,73,9,null,null,"68_73Y9M",10,"F",68,73,9]
[null,"68_73Y10M",1,"F",68,73,10,null,null,"68_73Y10M",10,"F",68,73,10]
[null,"68_73Y11M",1,"F",68,73,11,null,null,"68_73Y11M",10,"F",68,73,11]
[null,"68_74Y0M",1,"F",68,74,0,null,null,"68_74Y0M",10,"F",68,74,0]
[null,"68_74Y1M",1,"F",68,74,1,null,null,"68_74Y1M",10,"F",68,74,1]
[null,"68_74Y2M",1,"F",68,74,2,null,null,"68_74Y2M",10,"F",68,74,2]
[null,"68_74Y3M",1,"F",68,74,3,null,null,"68_74Y3M",10,"F",68,74,3]
[null,"68_74Y4M",1,"F",68,74,4,null,null,"68_74Y4M",10,"F",68,74,4]
[null,"68_74Y5M",1,"F",68,74,5,null,null,"68_74Y5M",10,"F",68,74,5]
[null,"68_74Y6M",1,"F",68,74,6,null,null,"68_74Y6M",10,"F",68,74,6]
[null,"68_74Y7M",1,"F",68,74,7,null,null,"68_74Y7M",10,"F",68,74,7]
[null,"68_74Y8M",1,"F",68,74,8,null,null,"68_74Y8M",10,"F",68,74,8]
[null,"68_74Y9M",1,"F",68,74,9,null,null,"68_74Y9M",10,"F",68,74,9]
[null,"68_74Y10M",1,"F",68,74,10,null,null,"68_74Y10M",10,"F",68,74,10]
[null,"68_74Y11M",1,"F",68,74,11,null,null,"68_74Y11M",10,"F",68,74,11]

{"sheet":"SPD Calculations_hide","index":4,"n_rows":253,"n_cols":18,"rows_kept":253,"cut":false,"hidden":true,"merged":[[22,4,22,15],[1,2,1,6],[33,1,33,2],[32,3,32,5],[19,4,19,12],[20,4,20,12],[21,4,21,12]]}
[null,null,{"$f":"strToolName","v":"SPD Calculator"}]
[null,"Description","Calculates state pension date, state pension Age in Y, YM and age as string based on In force policy.  This is a MyCSP administration tool and is not for public use.  This page can be used in it's entirety as an SPA tool in other calculation  tools, however these must be kept up to date if this tool changes."]
[]
[]
[null,null,{"$f":"strToolName&\" -  Inputs\"","v":"SPD Calculator -  Inputs"}]
[]
[]
[null,"Inputs"]
[]
[null,"Date of Birth",{"$f":"DATE(YEAR(DOB), MONTH(DOB),DAY(DOB))","v":"00:00:00"},"dayDOB"]
[]
[null,"Sex","Male","strSex","Assume always Male as females will not have DOB < 5/12/53 in alpha"]
[]
[]
[null,null,{"$f":"strToolName&\" - Results\"","v":"SPD Calculator - Results"}]
[]
[]
[null,"Results",null,null,"Audit"]
[]
[null,"State Pension Age as string as per .Gov site",{"$f":"IF(bSPDOverallError,_errSPDOverall,strSPA)","v":{"$error":"#N/A"}},"resstrSPA",{"$f":"msgPrint","v":"Calculation Date :13:49,  10 May 2019 .  "}]
[null,"State Pension  Date",{"$f":"IF(bSPDOverallError,_errSPDOverall,daySPD)","v":"00:00:00"},"resdaySPD",{"$f":"msgFileName","v":"Filename : \\\\mcclprdwssm085\\Users$\\VaughaJ\\My Documents\\[Copy of early-retirement-v1-1-april-2019. LOCKEDxlsm.xlsm"}]
[null,"State Pension Age In Complete Years (YY)",{"$f":"IF(bSPDOverallError,_errSPDOverall,dSPA_CY)","v":0},"resdSPA_CY",{"$f":"msgVersionNumber","v":"Calculator Version Number : 0.2.  "}]
[null,"State Pension Age In Complete Years and Months (YY+MM/12)",{"$f":"IF(bSPDOverallError,_errSPDOverall,dSPA_CYM)","v":0},"resdSPA_CYM",{"$f":"msgCaveats","v":"This SPA tool is based on the following in force Pensions Acts  95, 2007, 2011, 2014."}]
[]
[null,null,null,null,null,null,null,null,null,null,null,null," "]
[]
[]
[null,null,{"$f":"strToolName&\" - Calculations\"","v":"SPD Calculator - Calculations"}]
[null,null,null,null,null,null,null,null,null,null,null,{"$f":"\nIF(DAY(DATE(YEAR(I29+0)-YEAR(dayDOB),MONTH(I29+0)-MONTH(dayDOB)+1,DAY(I29+0)-DAY(dayDOB)+1))-1=0,\n    0,\n     DAY(DATE(YEAR(I29+0)-YEAR(dayDOB),MONTH(I29+0)-MONTH(dayDOB)+1,DAY(I29+0)-DAY(dayDOB)+1))-1)","v":0}]
[null,null,null,null,null,null,null,null,null,null,null,null,null,null,"daySPD","dSPA_CY","dSPA_CYM","strSPA"]
[null,"The data in this table (columns B to F) has been taken from the inforce pension acts.  For more information about the source of data refer to the MyCSP SPA Calculator Tool sheet 'BackgroundStats'.",null,null,null,null,null,null,null,null,null,null,"Results lookups : ",null,{"$f":"MAX(O35:O182)","v":"00:00:00"},{"$f":"MAX(P35:P182)","v":0},{"$f":"MAX(Q35:Q182)","v":0},{"$f":"VLOOKUP(dSPA_CYM,Q35:R123,2,0)","v":{"$error":"#N/A"}}]
[]
[null,null,null,"SPA is either defined as to an Age or Date, If age known complete age, if date known complete date.  All Ages YY+MM, where MM is m/12",null,null,null,"Intermediate Calculations",null,null,null,null,null,null,"Lookups"]
[null,"Period within which DOB falls",null,"Day pensionable age attained","Males SPA","Females SPA",null,"Use Date Or Age","State Pension Date (Calc)","SPA Year","SPA Month","SPA Day","SPA as string",null,"SPD Lookup","SPA Lookup Complete Years","SPA Lookup Complete Years And Months","SPA as String Lookup"]
[null,"1900-01-01","1950-04-05",null,65,60,null,{"$f":"IF(LEFT(LOWER(strSEX))=\"m\",IF(E35=\"\",\"Date\",\"Age\"), IF(LEFT(LOWER(strSEX))=\"f\",IF(F35=\"\",\"Date\",\"Age\"),\"N/A\"))","v":"Age"},{"$f":"IF(H35=\"Age\",DATE(YEAR(dayDOB)+INT(IF(strSEX=\"Male\",E35,F35)),MONTH(dayDOB)+(IF(strSEX=\"Male\",(E35-INT(E35))*12,(F35-INT(F35))*12)),DAY(dayDOB)),D35)","v":"1964-12-31"},{"$f":"YEAR(DATE(YEAR(I35+0)-YEAR(dayDOB),MONTH(I35+0)-MONTH(dayDOB)+1,DAY(I35+0)-DAY(dayDOB)+1))-1900","v":65},{"$f":"MONTH(DATE(YEAR(I35+0)-YEAR(dayDOB),MONTH(I35+0)-MONTH(dayDOB)+1,DAY(I35+0)-DAY(dayDOB)+1))-1","v":0},{"$f":"I35-DATE(YEAR(dayDOB)+J35,MONTH(dayDOB)+K35,DAY(dayDOB))-0","v":0},{"$f":"J35&\" Years \"&K35\n&\" Months \"&L35&\" Days\"","v":"65 Years 0 Months 0 Days"},null,{"$f":"IF(AND(dayDOB>=B35,dayDOB<=C35),I35,\"\")","v":""},{"$f":"IF(O35<>\"\",J35,\"\")","v":""},{"$f":"IF(O35<>\"\",J35+K35/12,\"\")","v":""},{"$f":"IF(P35<>\"\",M35,\"\")","v":""}]
[null,"1950-04-06","1950-05-05","2010-05-06",65,null,null,"Age","1964-12-31",65,0,0,"65 Years 0 Months 0 Days",null,"","","",""]
[null,"1950-05-06","1950-06-05","2010-07-06",65,null,null,"Age","1964-12-31",65,0,0,"65 Years 0 Months 0 Days",null,"","","",""]
[null,"1950-06-06","1950-07-05","2010-09-06",65,null,null,"Age","1964-12-31",65,0,0,"65 Years 0 Months 0 Days",null,"","","",""]
[null,"1950-07-06","1950-08-05","2010-11-06",65,null,null,"Age","1964-12-31",65,0,0,"65 Years 0 Months 0 Days",null,"","","",""]
[null,"1950-08-06","1950-09-05","2011-01-06",65,null,null,"Age","1964-12-31",65,0,0,"65 Years 0 Months 0 Days",null,"","","",""]
[null,"1950-09-06","1950-10-05","2011-03-06",65,null,null,"Age","1964-12-31",65,0,0,"65 Years 0 Months 0 Days",null,"","","",""]
[null,"1950-10-06","1950-11-05","2011-05-06",65,null,null,"Age","1964-12-31",65,0,0,"65 Years 0 Months 0 Days",null,"","","",""]
[null,"1950-11-06","1950-12-05","2011-07-06",65,null,null,"Age","1964-12-31",65,0,0,"65 Years 0 Months 0 Days",null,"","","",""]
[null,"1950-12-06","1951-01-05","2011-09-06",65,null,null,"Age","1964-12-31",65,0,0,"65 Years 0 Months 0 Days",null,"","","",""]
[null,"1951-01-06","1951-02-05","2011-11-06",65,null,null,"Age","1964-12-31",65,0,0,"65 Years 0 Months 0 Days",null,"","","",""]
[null,"1951-02-06","1951-03-05","2012-01-06",65,null,null,"Age","1964-12-31",65,0,0,"65 Years 0 Months 0 Days",null,"","","",""]
[null,"1951-03-06","1951-04-05","2012-03-06",65,null,null,"Age","1964-12-31",65,0,0,"65 Years 0 Months 0 Days",null,"","","",""]
[null,"1951-04-06","1951-05-05","2012-05-06",65,null,null,"Age","1964-12-31",65,0,0,"65 Years 0 Months 0 Days",null,"","","",""]
[null,"1951-05-06","1951-06-05","2012-07-06",65,null,null,"Age","1964-12-31",65,0,0,"65 Years 0 Months 0 Days",null,"","","",""]
[null,"1951-06-06","1951-07-05","2012-09-06",65,null,null,"Age","1964-12-31",65,0,0,"65 Years 0 Months 0 Days",null,"","","",""]
[null,"1951-07-06","1951-08-05","2012-11-06",65,null,null,"Age","1964-12-31",65,0,0,"65 Years 0 Months 0 Days",null,"","","",""]
[null,"1951-08-06","1951-09-05","2013-01-06",65,null,null,"Age","1964-12-31",65,0,0,"65 Years 0 Months 0 Days",null,"","","",""]
[null,"1951-09-06","1951-10-05","2013-03-06",65,null,null,"Age","1964-12-31",65,0,0,"65 Years 0 Months 0 Days",null,"","","",""]
[null,"1951-10-06","1951-11-05","2013-05-06",65,null,null,"Age","1964-12-31",65,0,0,"65 Years 0 Months 0 Days",null,"","","",""]
[null,"1951-11-06","1951-12-05","2013-07-06",65,null,null,"Age","1964-12-31",65,0,0,"65 Years 0 Months 0 Days",null,"","","",""]
[null,"1951-12-06","1952-01-05","2013-09-06",65,null,null,"Age","1964-12-31",65,0,0,"65 Years 0 Months 0 Days",null,"","","",""]
[null,"1952-01-06","1952-02-05","2013-11-06",65,null,null,"Age","1964-12-31",65,0,0,"65 Years 0 Months 0 Days",null,"","","",""]
[null,"1952-02-06","1952-03-05","2014-01-06",65,null,null,"Age","1964-12-31",65,0,0,"65 Years 0 Months 0 Days",null,"","","",""]
[null,"1952-03-06","1952-04-05","2014-03-06",65,null,null,"Age","1964-12-31",65,0,0,"65 Years 0 Months 0 Days",null,"","","",""]
[null,"1952-04-06","1952-05-05","2014-05-06",65,null,null,"Age","1964-12-31",65,0,0,"65 Years 0 Months 0 Days",null,"","","",""]
[null,"1952-05-06","1952-06-05","2014-07-06",65,null,null,"Age","1964-12-31",65,0,0,"65 Years 0 Months 0 Days",null,"","","",""]
[null,"1952-06-06","1952-07-05","2014-09-06",65,null,null,"Age","1964-12-31",65,0,0,"65 Years 0 Months 0 Days",null,"","","",""]
[null,"1952-07-06","1952-08-05","2014-11-06",65,null,null,"Age","1964-12-31",65,0,0,"65 Years 0 Months 0 Days",null,"","","",""]
[null,"1952-08-06","1952-09-05","2015-01-06",65,null,null,"Age","1964-12-31",65,0,0,"65 Years 0 Months 0 Days",null,"","","",""]
[null,"1952-09-06","1952-10-05","2015-03-06",65,null,null,"Age","1964-12-31",65,0,0,"65 Years 0 Months 0 Days",null,"","","",""]
[null,"1952-10-06","1952-11-05","2015-05-06",65,null,null,"Age","1964-12-31",65,0,0,"65 Years 0 Months 0 Days",null,"","","",""]
[null,"1952-11-06","1952-12-05","2015-07-06",65,null,null,{"$f":"IF(LEFT(LOWER(strSEX))=\"m\",IF(E67=\"\",\"Date\",\"Age\"), IF(LEFT(LOWER(strSEX))=\"f\",IF(F67=\"\",\"Date\",\"Age\"),\"N/A\"))","v":"Age"},{"$f":"IF(H67=\"Age\",DATE(YEAR(dayDOB)+INT(IF(strSEX=\"Male\",E67,F67)),MONTH(dayDOB)+(IF(strSEX=\"Male\",(E67-INT(E67))*12,(F67-INT(F67))*12)),DAY(dayDOB)),D67)","v":"1964-12-31"},{"$f":"YEAR(DATE(YEAR(I67+0)-YEAR(dayDOB),MONTH(I67+0)-MONTH(dayDOB)+1,DAY(I67+0)-DAY(dayDOB)+1))-1900","v":65},{"$f":"MONTH(DATE(YEAR(I67+0)-YEAR(dayDOB),MONTH(I67+0)-MONTH(dayDOB)+1,DAY(I67+0)-DAY(dayDOB)+1))-1","v":0},{"$f":"I67-DATE(YEAR(dayDOB)+J67,MONTH(dayDOB)+K67,DAY(dayDOB))-0","v":0},{"$f":"J67&\" Years \"&K67\n&\" Months \"&L67&\" Days\"","v":"65 Years 0 Months 0 Days"},null,{"$f":"IF(AND(dayDOB>=B67,dayDOB<=C67),I67,\"\")","v":""},{"$f":"IF(O67<>\"\",J67,\"\")","v":""},{"$f":"IF(O67<>\"\",J67+K67/12,\"\")","v":""},{"$f":"IF(P67<>\"\",M67,\"\")","v":""}]
[null,"1952-12-06","1953-01-05","2015-09-06",65,null,null,"Age","1964-12-31",65,0,0,"65 Years 0 Months 0 Days",null,"","","",""]
[null,"1953-01-06","1953-02-05","2015-11-06",65,null,null,"Age","1964-12-31",65,0,0,"65 Years 0 Months 0 Days",null,"","","",""]
[null,"1953-02-06","1953-03-05","2016-01-06",65,null,null,"Age","1964-12-31",65,0,0,"65 Years 0 Months 0 Days",null,"","","",""]
[null,"1953-03-06","1953-04-05","2016-03-06",65,null,null,"Age","1964-12-31",65,0,0,"65 Years 0 Months 0 Days",null,"","","",""]
[null,"1953-04-06","1953-05-05","2016-07-06",65,null,null,"Age","1964-12-31",65,0,0,"65 Years 0 Months 0 Days",null,"","","",""]
[null,"1953-05-06","1953-06-05","2016-11-06",65,null,null,"Age","1964-12-31",65,0,0,"65 Years 0 Months 0 Days",null,"","","",""]
[null,"1953-06-06","1953-07-05","2017-03-06",65,null,null,"Age","1964-12-31",65,0,0,"65 Years 0 Months 0 Days",null,"","","",""]
[null,"1953-07-06","1953-08-05","2017-07-06",65,null,null,"Age","1964-12-31",65,0,0,"65 Years 0 Months 0 Days",null,"","","",""]
[null,"1953-08-06","1953-09-05","2017-11-06",65,null,null,"Age","1964-12-31",65,0,0,"65 Years 0 Months 0 Days",null,"","","",""]
[null,"1953-09-06","1953-10-05","2018-03-06",65,null,null,"Age","1964-12-31",65,0,0,"65 Years 0 Months 0 Days",null,"","","",""]
[null,"1953-10-06","1953-11-05","2018-07-06",65,null,null,"Age","1964-12-31",65,0,0,"65 Years 0 Months 0 Days",null,"","","",""]
[null,"1953-11-06","1953-12-05","2018-11-06",65,null,"XXX","Age","1964-12-31",65,0,0,"65 Years 0 Months 0 Days",null,"","","",""]
[null,"1953-12-06","1954-01-05","2019-03-06",null,null,null,"Date","2019-03-06",119,2,6,"119 Years 2 Months 6 Days",null,"","","",""]
[null,"1954-01-06","1954-02-05","2019-05-06",null,null,null,"Date","2019-05-06",119,4,6,"119 Years 4 Months 6 Days",null,"","","",""]
[null,"1954-02-06","1954-03-05","2019-07-06",null,null,null,"Date","2019-07-06",119,6,6,"119 Years 6 Months 6 Days",null,"","","",""]
[null,"1954-03-06","1954-04-05","2019-09-06",null,null,null,"Date","2019-09-06",119,8,6,"119 Years 8 Months 6 Days",null,"","","",""]
[null,"1954-04-06","1954-05-05","2019-11-06",null,null,null,"Date","2019-11-06",119,10,6,"119 Years 10 Months 6 Days",null,"","","",""]
[null,"1954-05-06","1954-06-05","2020-01-06",null,null,null,"Date","2020-01-06",120,0,6,"120 Years 0 Months 6 Days",null,"","","",""]
[null,"1954-06-06","1954-07-05","2020-03-06",null,null,null,"Date","2020-03-06",120,2,6,"120 Years 2 Months 6 Days",null,"","","",""]
[null,"1954-07-06","1954-08-05","2020-05-06",null,null,null,"Date","2020-05-06",120,4,6,"120 Years 4 Months 6 Days",null,"","","",""]
[null,"1954-08-06","1954-09-05","2020-07-06",null,null,null,"Date","2020-07-06",120,6,6,"120 Years 6 Months 6 Days",null,"","","",""]
[null,"1954-09-06","1954-10-05","2020-09-06",null,null,null,"Date","2020-09-06",120,8,6,"120 Years 8 Months 6 Days",null,"","","",""]
[null,"1954-10-06","1960-04-05",null,66,66,null,"Age","1965-12-31",66,0,0,"66 Years 0 Months 0 Days",null,"","","",""]
[null,"1960-04-06","1960-05-05",null,66.083333333333329,66.083333333333329,null,"Age","1966-01-31",66,1,0,"66 Years 1 Months 0 Days",null,"","","",""]
[null,"1960-05-06","1960-06-05",null,66.166666666666671,66.166666666666671,null,"Age","1966-02-28",66,2,0,"66 Years 2 Months 0 Days",null,"","","",""]
[null,"1960-06-06","1960-07-05",null,66.25,66.25,null,"Age","1966-03-31",66,3,0,"66 Years 3 Months 0 Days",null,"","","",""]
[null,"1960-07-06","1960-07-30",null,66.3333333333333,66.333333333333329,null,"Age","1966-04-30",66,4,0,"66 Years 4 Months 0 Days",null,"","","",""]
[null,"1960-07-31","1960-07-31","2026-11-30",null,null,null,"Date","2026-11-30",66,4,0,"66 Years 4 Months 0 Days",null,"","","",""]
[null,"1960-08-01","1960-08-05",null,66.333333333333329,66.333333333333329,null,"Age","1966-04-30",{"$f":"YEAR(DATE(YEAR(I96+0)-YEAR(dayDOB),MONTH(I96+0)-MONTH(dayDOB)+1,DAY(I96+0)-DAY(dayDOB)+1))-1900","v":66},{"$f":"MONTH(DATE(YEAR(I96+0)-YEAR(dayDOB),MONTH(I96+0)-MONTH(dayDOB)+1,DAY(I96+0)-DAY(dayDOB)+1))-1","v":4},{"$f":"I96-DATE(YEAR(dayDOB)+J96,MONTH(dayDOB)+K96,DAY(dayDOB))-0","v":0},"66 Years 4 Months 0 Days",null,"","","",""]
[null,"1960-08-06","1960-09-05",null,66.416666666666671,66.416666666666671,null,"Age","1966-05-31",66,5,0,"66 Years 5 Months 0 Days",null,"","","",""]
[null,"1960-09-06","1960-10-05",null,66.5,66.5,null,"Age","1966-06-30",66,6,0,"66 Years 6 Months 0 Days",null,"","","",""]
[null,"1960-10-06","1960-11-05",null,66.583333333333329,66.583333333333329,null,{"$f":"IF(LEFT(LOWER(strSEX))=\"m\",IF(E99=\"\",\"Date\",\"Age\"), IF(LEFT(LOWER(strSEX))=\"f\",IF(F99=\"\",\"Date\",\"Age\"),\"N/A\"))","v":"Age"},{"$f":"IF(H99=\"Age\",DATE(YEAR(dayDOB)+INT(IF(strSEX=\"Male\",E99,F99)),MONTH(dayDOB)+(IF(strSEX=\"Male\",(E99-INT(E99))*12,(F99-INT(F99))*12)),DAY(dayDOB)),D99)","v":"1966-07-31"},66,7,0,{"$f":"J99&\" Years \"&K99\n&\" Months \"&L99&\" Days\"","v":"66 Years 7 Months 0 Days"},null,{"$f":"IF(AND(dayDOB>=B99,dayDOB<=C99),I99,\"\")","v":""},{"$f":"IF(O99<>\"\",J99,\"\")","v":""},{"$f":"IF(O99<>\"\",J99+K99/12,\"\")","v":""},{"$f":"IF(P99<>\"\",M99,\"\")","v":""}]
[null,"1960-11-06","1960-12-05",null,66.666666666666671,66.666666666666671,null,"Age","1966-08-31",66,8,0,"66 Years 8 Months 0 Days",null,"","","",""]
[null,"1960-12-06","1960-12-30",null,66.75,66.75,null,"Age","1966-09-30",66,9,0,"66 Years 9 Months 0 Days",null,"","","",""]
[null,"1960-12-31","1960-12-31","2027-09-30",null,null,null,"Date","2027-09-30",66,9,0,"66 Years 9 Months 0 Days",null,"","","",""]
[null,"1961-01-01","1961-01-05",null,66.75,66.75,null,"Age","1966-09-30",{"$f":"YEAR(DATE(YEAR(I103+0)-YEAR(dayDOB),MONTH(I103+0)-MONTH(dayDOB)+1,DAY(I103+0)-DAY(dayDOB)+1))-1900","v":66},{"$f":"MONTH(DATE(YEAR(I103+0)-YEAR(dayDOB),MONTH(I103+0)-MONTH(dayDOB)+1,DAY(I103+0)-DAY(dayDOB)+1))-1","v":9},{"$f":"I103-DATE(YEAR(dayDOB)+J103,MONTH(dayDOB)+K103,DAY(dayDOB))-0","v":0},"66 Years 9 Months 0 Days",null,"","","",""]
[null,"1961-01-06","1961-01-30",null,66.833333333333329,66.833333333333329,null,"Age","1966-10-31",{"$f":"YEAR(DATE(YEAR(I104+0)-YEAR(dayDOB),MONTH(I104+0)-MONTH(dayDOB)+1,DAY(I104+0)-DAY(dayDOB)+1))-1900","v":66},{"$f":"MONTH(DATE(YEAR(I104+0)-YEAR(dayDOB),MONTH(I104+0)-MONTH(dayDOB)+1,DAY(I104+0)-DAY(dayDOB)+1))-1","v":10},{"$f":"I104-DATE(YEAR(dayDOB)+J104,MONTH(dayDOB)+K104,DAY(dayDOB))-0","v":0},"66 Years 10 Months 0 Days",null,"","","",""]
[null,"1961-01-31","1961-01-31","2027-11-30",null,null,null,"Date","2027-11-30",66,10,0,"66 Years 10 Months 0 Days",null,"","","",""]
[null,"1961-02-01","1961-02-05",null,66.833333333333329,66.833333333333329,null,"Age","1966-10-31",{"$f":"YEAR(DATE(YEAR(I106+0)-YEAR(dayDOB),MONTH(I106+0)-MONTH(dayDOB)+1,DAY(I106+0)-DAY(dayDOB)+1))-1900","v":66},{"$f":"MONTH(DATE(YEAR(I106+0)-YEAR(dayDOB),MONTH(I106+0)-MONTH(dayDOB)+1,DAY(I106+0)-DAY(dayDOB)+1))-1","v":10},{"$f":"I106-DATE(YEAR(dayDOB)+J106,MONTH(dayDOB)+K106,DAY(dayDOB))-0","v":0},"66 Years 10 Months 0 Days",null,"","","",""]
[null,"1961-02-06","1961-03-05",null,66.916666666666671,66.916666666666671,null,"Age","1966-11-30",66,11,0,"66 Years 11 Months 0 Days",null,"","","",""]
[null,"1961-03-06","1961-04-05",null,67,67,null,"Age","1966-12-31",67,0,0,"67 Years 0 Months 0 Days",null,"","","",""]
[null,"1961-04-06","1969-04-05",null,67,67,null,"Age","1966-12-31",67,0,0,"67 Years 0 Months 0 Days",null,"","","",""]
[null,"1969-04-06","1977-04-05",null,67,67,null,"Age","1966-12-31",67,0,0,"67 Years 0 Months 0 Days",null,"","","",""]
[null,"1977-04-06","1977-05-05","2044-05-06",null,null,null,"Date","2044-05-06",144,4,6,"144 Years 4 Months 6 Days",null,"","","",""]
[null,"1977-05-06","1977-06-05","2044-07-06",null,null,null,"Date","2044-07-06",144,6,6,"144 Years 6 Months 6 Days",null,"","","",""]
[null,"1977-06-06","1977-07-05","2044-09-06",null,null,null,"Date","2044-09-06",144,8,6,"144 Years 8 Months 6 Days",null,"","","",""]
[null,"1977-07-06","1977-08-05","2044-11-06",null,null,null,"Date","2044-11-06",144,10,6,"144 Years 10 Months 6 Days",null,"","","",""]
[null,"1977-08-06","1977-09-05","2045-01-06",null,null,null,"Date","2045-01-06",145,0,6,"145 Years 0 Months 6 Days",null,"","","",""]
[null,"1977-09-06","1977-10-05","2045-03-06",null,null,null,"Date","2045-03-06",145,2,6,"145 Years 2 Months 6 Days",null,"","","",""]
[null,"1977-10-06","1977-11-05","2045-05-06",null,null,null,"Date","2045-05-06",145,4,6,"145 Years 4 Months 6 Days",null,"","","",""]
[null,"1977-11-06","1977-12-05","2045-07-06",null,null,null,"Date","2045-07-06",145,6,6,"145 Years 6 Months 6 Days",null,"","","",""]
[null,"1977-12-06","1978-01-05","2045-09-06",null,null,null,"Date","2045-09-06",145,8,6,"145 Years 8 Months 6 Days",null,"","","",""]
[null,"1978-01-06","1978-02-05","2045-11-06",null,null,null,"Date","2045-11-06",145,10,6,"145 Years 10 Months 6 Days",null,"","","",""]
[null,"1978-02-06","1978-03-05","2046-01-06",null,null,null,"Date","2046-01-06",146,0,6,"146 Years 0 Months 6 Days",null,"","","",""]
[null,"1978-03-06","1978-04-05","2046-03-06",null,null,null,"Date","2046-03-06",146,2,6,"146 Years 2 Months 6 Days",null,"","","",""]
[null,"1978-04-06","2999-12-31",null,68,68,null,"Age","1967-12-31",68,0,0,"68 Years 0 Months 0 Days",null,"","","",""]
[]
[]
[null,null,null,null,null,null,null,null,{"$f":"IF(H126=\"Age\",DATE(YEAR(dayDOB)+IF(strSEX=\"Male\",E126,F126),MONTH(dayDOB),DAY(dayDOB)),D126)","v":"00:00:00"}]
[null,null,null,null,null,null,null,null,"00:00:00"]
[null,null,null,null,null,null,null,null,"00:00:00"]
[null,null,null,null,null,null,null,null,"00:00:00"]
[null,null,null,null,null,null,null,null,"00:00:00"]
[null,null,null,null,null,null,null,null,"00:00:00"]
[null,null,null,null,null,null,null,null,"00:00:00"]
[null,null,null,null,null,null,null,null,"00:00:00"]
[null,null,null,null,null,null,null,null,"00:00:00"]
[null,null,null,null,null,null,null,null,"00:00:00"]
[null,null,null,null,null,null,null,null,"00:00:00"]
[null,null,null,null,null,null,null,null,"00:00:00"]
[null,null,null,null,null,null,null,null,"00:00:00"]
[null,null,null,null,null,null,null,null,"00:00:00"]
[null,null,null,null,null,null,null,null,"00:00:00"]
[null,null,null,null,null,null,null,null,"00:00:00"]
[null,null,null,null,null,null,null,null,"00:00:00"]
[null,null,null,null,null,null,null,null,"00:00:00"]
[null,null,null,null,null,null,null,null,"00:00:00"]
[null,null,null,null,null,null,null,null,"00:00:00"]
[null,null,null,null,null,null,null,null,"00:00:00"]
[null,null,null,null,null,null,null,null,"00:00:00"]
[null,null,null,null,null,null,null,null,"00:00:00"]
[null,null,null,null,null,null,null,null,"00:00:00"]
[null,null,null,null,null,null,null,null,"00:00:00"]
[null,null,null,null,null,null,null,null,"00:00:00"]
[null,null,null,null,null,null,null,null,"00:00:00"]
[null,null,null,null,null,null,null,null,"00:00:00"]
[null,null,null,null,null,null,null,null,"00:00:00"]
[null,null,null,null,null,null,null,null,"00:00:00"]
[null,null,null,null,null,null,null,null,"00:00:00"]
[null,null,null,null,null,null,null,null,"00:00:00"]
[null,null,null,null,null,null,null,null,{"$f":"IF(H158=\"Age\",DATE(YEAR(dayDOB)+IF(strSEX=\"Male\",E158,F158),MONTH(dayDOB),DAY(dayDOB)),D158)","v":"00:00:00"}]
[null,null,null,null,null,null,null,null,"00:00:00"]
[null,null,null,null,null,null,null,null,"00:00:00"]
[null,null,null,null,null,null,null,null,"00:00:00"]
[null,null,null,null,null,null,null,null,"00:00:00"]
[null,null,null,null,null,null,null,null,"00:00:00"]
[null,null,null,null,null,null,null,null,"00:00:00"]
[null,null,null,null,null,null,null,null,"00:00:00"]
[null,null,null,null,null,null,null,null,"00:00:00"]
[null,null,null,null,null,null,null,null,"00:00:00"]
[null,null,null,null,null,null,null,null,"00:00:00"]
[null,null,null,null,null,null,null,null,"00:00:00"]
[null,null,null,null,null,null,null,null,"00:00:00"]
[null,null,null,null,null,null,null,null,"00:00:00"]
[null,null,null,null,null,null,null,null,"00:00:00"]
[null,null,null,null,null,null,null,null,"00:00:00"]
[null,null,null,null,null,null,null,null,"00:00:00"]
[null,null,null,null,null,null,null,null,"00:00:00"]
[null,null,null,null,null,null,null,null,"00:00:00"]
[null,null,null,null,null,null,null,null,"00:00:00"]
[null,null,null,null,null,null,null,null,"00:00:00"]
[null,null,null,null,null,null,null,null,"00:00:00"]
[null,null,null,null,null,null,null,null,"00:00:00"]
[null,null,null,null,null,null,null,null,"00:00:00"]
[null,null,null,null,null,null,null,null,"00:00:00"]
[]
[]
[]
[]
[]
[]
[]
[]
[]
[]
[]
[]
[]
[]
[]
[]
[]
[]
[]
[]
[]
[]
[]
[null,null,{"$f":"strToolName&\" - System Variables\"","v":"SPD Calculator - System Variables"}]
[]
[]
[null,"Version Number",0.2,"VersionNumber"]
[null,"Security Classification","Unclassified","SecurityClassification"]
[null,"Tool Name","SPD Calculator","strToolName"]
[null,"Today's Date",{"$f":"TODAY()","v":"2019-05-10"},"dayToday"]
[]
[]
[]
[]
[null,null,{"$f":"strToolName&\" - Tables\"","v":"SPD Calculator - Tables"}]
[]
[]
[null,"Tables used in calculations/sheets"]
[]
[null,"tabSex"]
[null,"Sex"]
[null,"Male"]
[null,"Female"]
[]
[]
[]
[]
[null,null,"CSCS - Errors and Messages"]
[]
[]
[null,"Error and other messages"]
[null,"General"]
[null,{"$f":"IF(bVersionError,\"Check Version Number.  \",\"\")","v":""},null,null,null,null,null,null,"_errVersion"]
[null,{"$f":"IF(bSPDOverallError,\"SPA ERROR :\"&_errExpiration&_errVersion&_errSex,\"\")","v":""},null,null,null,null,null,null,"_errOverall"]
[null,{"$f":"\"Error\"","v":"Error"},null,null,null,null,null,null,"_errOverallShort"]
[null,{"$f":"\"Security Classification: \"&SecurityClassification&\".  \"","v":"Security Classification: Unclassified.  "},null,null,null,null,null,null,"msgSecurityClassification"]
[null,{"$f":"\"Calculation Date :\" &TEXT(NOW(),\"hh:mm,  dd mmm yyyy \")&\".  \"","v":"Calculation Date :13:49,  10 May 2019 .  "},null,null,null,null,null,null,"msgPrint"]
[null,{"$f":"\"Calculator Version Number : \"&(TEXT(VersionNumber,\"0.0\"))&\".  \"","v":"Calculator Version Number : 0.2.  "},null,null,null,null,null,null,"msgVersionNumber"]
[null,{"$f":"\"Filename : \"&LEFT(CELL(\"filename\",strToolName),FIND(\"]\",CELL(\"filename\",strToolName))-1)","v":"Filename : \\\\mcclprdwssm085\\Users$\\VaughaJ\\My Documents\\[Copy of early-retirement-v1-1-april-2019. LOCKEDxlsm.xlsm"},null,null,null,null,null,null,"msgFileName"]
[null,"This SPA tool is based on the following in force Pensions Acts  95, 2007, 2011, 2014.",null,null,null,null,null,null,"msgCaveats"]
[null,{"$f":"\"-\"","v":"-"},null,null,null,null,null,null,"errError"]
[null,{"$f":"IF(bSexError,\"Sex Incorrect\",\"\")","v":""},null,null,null,null,null,null,"_errSex"]
[]
[]
[null,null,{"$f":"$C$1&\" - Error Checking\"","v":"SPD Calculator - Error Checking"}]
[]
[]
[null,"Error Checking"]
[null,"Sex Error (FALSE=OK)",{"$f":"IF(OR(LEFT(LOWER(strSEX))=\"m\",LEFT(LOWER(strSEX))=\"f\"),FALSE,TRUE)","v":false},"bSexError"]
[null,"Version (FALSE=OK)",false,"bVersionError","* If this is sheet has been inserted in to another sheet, this error check will not apply"]
[null,"Overall Error (FALSE=OK)",{"$f":"IF(OR(bSexError,bVersionError),TRUE,FALSE)","v":false},"bOverallError"]

{"sheet":"Cover Sheet_hide","index":5,"n_rows":21,"n_cols":11,"rows_kept":21,"cut":false,"hidden":true,"merged":[[1,1,7,10],[10,1,10,10]]}
[]
[null,"MyCSP\nSCU\nActuarial Reduction Buy-out Calculator\nName : Actuarial Reduction.xlsm"]
[]
[]
[]
[]
[]
[]
[]
[]
[null,{"$f":"msgSecurityClassification","v":"Security Classification: Unclassified.  "}]
[]
[]
[null,"Revision History"]
[null,"Version ","Name of file","Previous Version","Date","Author ","Team ","Description","Reviewed By, Name","Review Date","Review Comments and sign off"]
[null,0.4,"EarlyRetirement V0.14xlsm","Original Tool : ActuarialReductionv0 14 23072014.xlsm","2014-08-19","Rob Mann","SCU","This is a new early retirement tool requested by CB and CU on 19082014.  It is based on an existing tool : ActuarialReductionv0 14 23072014.xlsm.  The tool removes all alpha references and cost of reduction and adds new Years and Days and Salary fields for FS schemes.  ","Jenna Rawlingson, SCU","2014-08-22","See email"]
[null,0.6,"EarlyRetirement V0.6.xlsm","EarlyRetirement V0.14xlsm","2014-08-25","Rob Mann","SCU","Updated based on SCU (Jenna Rawlingson) comments.  Main updates are: removal of all nuvos calcs, removal of part 1 references, additional validation for Min pension age and max Service, caveats and additional instructions.","Cath Cooney SCU","2014-08-27","See email"]
[null,0.8,"EarlyRetirement V0.8.xlsm","EarlyRetirement V0.6.xlsm","2014-08-28","Rob Mann","SCU","Updated based on SCU Cath Cooney's comment.  Main updates are some word changes, font chnages, added Guidance sheet to PDF, some formatting."]
[null,0.9,"EarlyRetirement V0.9.xlsm","EarlyRetirement V0.8.xlsm","2014-09-29","Rob Mann","SCU","Updated for word changes","Cath Cooney SCU"]
[null,1,"EarlyRetirement V1.0.xlsm","EarlyRetirement V0.9.xlsm","2014-09-29","Rob Mann","SCU","Updated protection and passwords and version to 1.0"]
[null,1.1000000000000001,"EarlyRetirement V1.1.xlsm","EarlyRetirement V1.0.xlsm","2019-04-05","Scott McGee","Applications Team","Updated Factors","Paul Cooper","2019-04-05"]