{"text_format":"1","workbook":"xlsx","n_sheets":8,"sheets":["Guidance","Pensions Questionnaire","Joiner Calculations_hide","SPD Calculations_Hide","PresenceCheck_Calculations","System Calcs,Assump,Table_hide","Cover Sheet_hide","Email Templates"],"not_rendered":{"charts":0,"images":2,"macros":1,"external_links":0,"defined_names":221,"comments":4,"pivot_tables":0},"unopened":[],"bounds":{"document_bytes":16777216,"sheet_cells":100000,"rows_first":2000,"rows_last":500,"rows_between":2000,"halvings":0,"cell_chars":16384,"cell_head_chars":4096},"cells_cut":0,"cells_raw":0,"read":"row_number_cap","date_system":"1900"}

{"sheet":"Guidance","index":0,"n_rows":5,"n_cols":2,"rows_kept":5,"cut":false,"hidden":false,"merged":[[0,1,2,11],[4,1,4,11]]}
[null,"Joiner Tool"]
[]
[]
[]
[null,"Welcome to the Joiner Tool – Civil Service Pension Schemes - classic, classic plus, premium, alpha\n"]

{"sheet":"Pensions Questionnaire","index":1,"n_rows":162,"n_cols":27,"rows_kept":162,"cut":false,"hidden":false,"merged":[[63,1,63,3],[63,4,63,7],[64,1,64,3],[38,4,38,7],[39,4,39,7],[46,4,46,7],[64,4,64,7],[57,2,57,12],[58,1,58,6],[48,1,48,6],[49,4,49,7],[49,1,49,3],[55,2,55,12],[56,2,56,12],[43,4,43,7],[59,1,59,12],[60,1,60,3],[60,4,60,7],[61,1,61,3],[61,4,61,7],[62,1,62,3],[62,4,62,7],[40,4,40,7],[41,4,41,7],[42,4,42,7],[53,2,53,12],[44,4,44,7],[45,4,45,7],[51,1,51,6],[52,2,52,12],[54,2,54,12],[0,1,2,12],[7,4,7,7],[9,4,9,7],[20,4,20,7],[11,4,11,7],[13,4,13,7],[15,4,15,7],[23,4,23,7],[17,4,17,7],[21,4,21,7],[17,1,17,3],[23,1,23,3],[22,1,22,3],[21,1,21,3],[20,1,20,3],[3,1,3,12],[19,1,19,12],[92,1,92,3],[106,1,106,3],[94,1,94,3],[96,1,96,3],[98,1,98,3],[149,1,149,3],[112,1,112,12],[141,1,141,3],[142,1,142,3],[143,1,143,3],[144,1,144,3],[145,1,145,3],[146,1,146,3],[147,1,147,3],[148,1,148,3],[133,1,133,3],[133,4,133,12],[115,4,115,12],[117,4,117,12],[119,4,119,12],[106,4,106,7],[121,4,121,12],[123,4,123,12],[90,1,90,3],[74,4,74,7],[74,1,74,3],[160,1,160,12],[158,1,158,12],[115,1,115,3],[117,1,117,3],[119,1,119,3],[121,1,121,3],[123,1,123,3],[125,1,125,3],[127,1,127,3],[129,1,129,3],[131,1,131,3],[157,1,157,12],[159,1,159,12],[156,1,156,12],[155,1,155,12],[92,4,92,7],[94,4,94,7],[96,4,96,7],[98,4,98,7],[78,4,78,7],[102,1,102,3],[25,1,25,3],[22,4,22,7],[30,1,30,13],[36,4,36,7],[37,4,37,7],[24,4,24,7],[26,4,26,9],[25,4,25,9],[24,1,24,3],[27,4,27,9],[27,1,27,3],[29,1,29,12],[34,0,34,12],[31,1,31,12],[32,2,32,12],[33,1,33,3],[33,4,33,7],[26,1,26,3],[88,1,88,3],[78,1,78,3],[80,1,80,3],[84,1,84,3],[69,1,69,13],[70,2,70,12],[65,1,65,3],[65,4,65,7],[66,1,66,3],[66,4,66,7],[67,1,67,3],[67,4,67,7],[76,4,76,7],[76,1,76,3],[72,4,72,7],[5,1,5,12],[108,1,108,3],[108,4,108,7],[125,4,125,12],[127,4,127,12],[129,4,129,12],[131,4,131,12],[136,4,136,12],[137,4,137,12],[21,9,21,12],[22,9,22,12],[100,4,100,7],[90,4,90,7],[80,4,80,7],[82,4,82,7],[84,4,84,7],[82,1,82,3],[104,1,104,3],[100,1,100,3],[102,4,102,7],[104,4,104,7],[86,4,86,7],[88,4,88,7],[86,1,86,3]],"read":"row_number_cap"}
[null,{"$f":"strToolName","v":"Joiner Tool"}]
[]
[null,null,null,null,null,null,null,null,null,null,null,null,null,null,null,null,null,null,null,null,null,null,null,null,"Top section error count",{"$f":"SUM(Z7:Z52)","v":7}]
[null,"Stage 1 - Member's details",null,null,null,null,null,null,null,null,null,null,null,null,null,null,null,null,"Display and Look Up data",null,"uiErrorCount",null,null,null,"erro Count",{"$f":"SUM(Z7:Z137)","v":7},"uiErrorCount"]
["hide",null,null,null,null,null,null,null,"Error column","Message column",null,null,null,null,null,null,null,null,"Question Code","Required field?","Result Name or reference name","Result","Display if dependent on other values?","Result Found","Error Message","ErrorCount","Notes"]
[null,"You should use this tool for new appointments that will commence on, or after, 1 April 2015. This tool will tell you the correct scheme (including the new scheme, alpha) to enrol the employee into to ensure they receive the relevant starter pack and information.\nPlease complete the stages in numerical order. Stages will expand and collapse as you work your way through the form."]
[null,null,null,null,null,null,null,null,null,null,null,null,null,null,null,null,null,null,null,null,null,{"$f":"IF(S7<>\"\",E7,\"\")","v":""},null,null,null,{"$f":"IF(Y7<>\"\",1,0)","v":0}]
[null,null,null,"Name : ",null,null,null,null,{"$f":"IF(tabErrorMessage<>\"\",tabErrorMessage,\"\")","v":"Enter Value"},null,null,null,null,null,null,null,null,null,null,"y","uiName",{"$f":"IF(S8<>\"\",E8,\"\")","v":""},true,null,{"$f":"IF(AND(E8=\"\",W8=TRUE),\"Enter Value\",\"\")","v":"Enter Value"},{"$f":"IF(Y8<>\"\",1,0)","v":1}]
[null,null,null,null,null,null,null,null,null,null,null,null,null,null,null,null,null,null,null,null,null,"",null,null,null,0]
[null,null,null,"National Insurance number : ",null,null,null,null,{"$f":"IF(tabErrorMessage<>\"\",tabErrorMessage,\"\")","v":"Enter Value"},null,null,null,null,null,null,null,null,null,null,"y","uiNINO","",true,null,{"$f":"IF(AND(E10=\"\",W10=TRUE),\"Enter Value\",\"\")","v":"Enter Value"},1]
[null,null,null,null,null,null,null,null,null,null,null,null,null,null,null,null,null,null,null,null,null,"",null,null,null,0]
[null,null,null,"Date of birth : ",null,null,null,null,{"$f":"IF(tabErrorMessage<>\"\",tabErrorMessage,\"\")","v":"Enter Value"},null,null,null,null,null,null,null,null,null,null,"y","uiDOB","",true,null,{"$f":"IF(AND(E12=\"\",W12=TRUE),\"Enter Value\",\"\")","v":"Enter Value"},1,"Data gathering as per original"]
[null,null,null,null,null,null,null,null,null,null,null,null,null,null,null,null,null,null,null,null,null,"",null,null,null,0]
[null,null,null,"Start date of new period of service : ",null,null,null,null,{"$f":"IF(tabErrorMessage<>\"\",tabErrorMessage,\"\")","v":"Enter Value"},null,null,null,null,null,null,null,null,null,null,"y","uiStartDate","",true,null,{"$f":"IF(AND(E14=\"\",W14=TRUE),\"Enter Value\",\"\")","v":"Enter Value"},1]
[null,null,null,null,null,null,null,null,null,null,null,null,null,null,null,null,null,null,null,null,null,"",{"$f":"IF(U15<>\"\",F15,\"\")","v":""},null,null,0]
[null,null,null,"Gender : ",null,null,null,null,{"$f":"IF(tabErrorMessage<>\"\",tabErrorMessage,\"\")","v":"Enter Value"},null,null,null,null,null,null,null,null,null,{"$f":"62+65-15","v":112},null,"uiSex",{"$f":"IF(S16<>\"\",E16,\"\")","v":0},true,null,{"$f":"IF(AND(E16=\"\",W16=TRUE),\"Enter Value\",\"\")","v":"Enter Value"},1]
[null,null,null,null,null,null,null,null,null,null,null,null,null,null,null,null,null,null,null,null,null,null,null,null,null,0]
[null,"Member's State Pension age based on current legislation at date of calculation:",null,null,{"$f":"ressSPA","v":""},null,null,null,null,null,null,null,null,null,null,null,null,null,{"$f":"YEAR((DATE(YEAR(uiDOB)+65,MONTH(uiDOB),DAY(uiDOB))))-YEAR(DATE(2012,1,1))","v":-48},null,null,{"$f":"IF(S18<>\"\",E18,\"\")","v":""},true,null,null,0]
[null,null,null,null,null,null,null,null,null,null,null,null,null,null,null,null,null,null,null,null,null,null,null,null,null,0]
[null,"Stage 2 - Member's Public and Civil Service pension history",null,null,null,null,null,null,null,null,null,null,null,null,null,null,null,null,null,null,null,"","",null,null,0]
{"$rows_left_out":143}
{"sheet":"Joiner Calculations_hide","index":2,"n_rows":613,"n_cols":49,"rows_kept":613,"cut":false,"hidden":true,"merged":[[3,2,3,6],[4,2,4,6],[56,2,56,6],[10,2,10,6],[97,16,97,26],[30,2,30,6],[38,2,38,6],[39,2,39,6]]}
[null,null,{"$f":"strToolName","v":"Joiner Tool"}]
[]
[]
[null,"Description","This sheet is intended to be used by ADMINISTRATION staff as a backend tool.  It is not expected that this will be exposed to the public users.  This tool was developed quickly and include a lot of redundant code that was left in so as not to break existing functionality and so speed up the development process.  This should be backed out at some point in the future."]
[null,"Schemes","All"]
[]
[]
[null,null,{"$f":"strToolName&\" - Inputs Calculations\"","v":"Joiner Tool - Inputs Calculations"}]
[]
[]
[null,"Description","The joiner tool provides the logic to determine if a member if a JOINER or REJOINER.  This logic includes all  the  2015 PS/CS history, rejoiner rationale, Taper dates etc."]
[]
[null,"Stage 1 - Personal Details"]
[null,"Name",{"$f":"uiName","v":0},"Name",null,"Key to cell colours:"]
[null,"National Insurance Number",{"$f":"uiNINO","v":0},"NINO",null,"User inputs from input sheet (yellow)"]
[null,"Your date of birth",{"$f":"uiDOB","v":"00:00:00"},"DOB",null,"Work Variable (orange)"]
[null,"When are you starting work?",{"$f":"uiStartDate","v":"00:00:00"},"StartDate",null,"Output (green)"]
[null,"Sex?",{"$f":"uiSex","v":0},"Sex",null,"Messages (pink)"]
[]
[null,"Stage 2 - Joining Status - About your Public and Civil Pensionable Service History",null,null,null,"System Variable (dark green)"]
{"$rows_left_out":594}
{"sheet":"SPD Calculations_Hide","index":3,"n_rows":222,"n_cols":22,"rows_kept":222,"cut":false,"hidden":true,"merged":[[1,2,1,6],[32,1,32,2],[31,3,31,5]]}
[null,null,"SPD"]
[null,"Description","Calculates state pension date, state pension Age in Y, YM and age as string based on In force policy.  This is a MyCSP administration tool and is not for public use.  This page can be used in it's entirety as an SPA tool in other calculation  tools, however these must be kept up to date if this tool changes."]
[]
[]
[null,null,{"$f":"SPDToolName&\" -  Inputs\"","v":"SPD -  Inputs"}]
[]
[]
[null,"Inputs"]
[]
[null,"Date of Birth",{"$f":"'Joiner Calculations_hide'!DOB","v":"00:00:00"},"dayDOB"]
[]
[null,"Sex",{"$f":"Sex","v":0},"strSex"]
[]
[]
[null,null,{"$f":"SPDToolName&\" - Results\"","v":"SPD - Results"}]
[]
[]
[null,"Results"]
[]
[null,"State Pension Age as string as per .Gov site",{"$f":"IF(OR(bSexError,bDOBError),_errOverall,strSPA)","v":"SPA ERROR :Sex IncorrectFALSEDOB Incorrect"},"resstrSPA"]
{"$rows_left_out":203}
{"sheet":"PresenceCheck_Calculations","index":4,"n_rows":91,"n_cols":19,"rows_kept":91,"cut":false,"hidden":true,"merged":[[5,2,5,9],[3,2,3,8],[4,2,4,8]]}
[null,null,"(Admin View) Taper/PS/CS Calculations"]
[]
[]
[null,"Description","This sheet is used to establish the member's presences at 1/4/2012 and Taper Status"]
[null,"Schemes","NA"]
[null,null,"Exceptions :  TV Ins, TV Outs, Partial/Full Retirement, Machinery of Government, ROC [TBC]"]
[]
[]
[null,null,{"$f":"$C$1&\" - Inputs\"","v":"(Admin View) Taper/PS/CS Calculations - Inputs"}]
[]
[null,"NOT USED : Initial Eligibility, Have rights been extinguished?",null,null,"Error?"]
[null,"Have you had a transfer out?","No","strTVOut",{"$f":"IF(strTVOut=\"Yes\",TRUE,FALSE)","v":false},"bTVOut"]
[null,"Have you had a transfer in?","No","strTVIn",{"$f":"IF(strTVIn=\"Yes\",TRUE,FALSE)","v":false},"bTVIn"]
[null,"Have you had a return of contributions?","No","strROC",{"$f":"IF(strROC=\"Yes\",TRUE,FALSE)","v":false},"bROC"]
[null,"Have you been subject to Machinery of Government","No","strMoG",{"$f":"IF(strMoG=\"Yes\",TRUE,FALSE)","v":false},"bMoG"]
[null,"Have you taken partial retirement?","No","strPartialRet",{"$f":"IF(strPartialRet=\"Yes\",TRUE,FALSE)","v":false},"bPartialRet"]
[null,"Have you taken full retirement?","No","strFullRet",{"$f":"IF(strFullRet=\"Yes\",TRUE,FALSE)","v":false},"bFullRet"]
[]
[]
[]
{"$rows_left_out":72}
{"sheet":"System Calcs,Assump,Table_hide","index":5,"n_rows":125,"n_cols":9,"rows_kept":125,"cut":false,"hidden":true,"merged":[[3,2,3,6],[4,2,4,6]]}
[null,null,{"$f":"strToolName& \" (Admin view) joiner - Global tables, assumptions, errors\"","v":"Joiner Tool (Admin view) joiner - Global tables, assumptions, errors"}]
[]
[]
[null,"Description","This calculator is used to determine the which scheme and pack should be sent to a CSP joiner.  This sheet is intended to be used by ADMINISTRATION staff as a backend tool.  It is not expected that this will be exposed to the public users."]
[null,"Schemes","Classic, Classic Plus, Premium, nuvos, alpha"]
[]
[]
[]
[null,null,{"$f":"$C$1&\" - Error Checking\"","v":"Joiner Tool (Admin view) joiner - Global tables, assumptions, errors - Error Checking"}]
[]
[]
[null,"Error Checking"]
[]
[null,"Errors",null,null,"Error Messages"]
[null,"Questionnaire inputs error (FALSE=OK)",{"$f":"IF(uiErrorCount>0,TRUE,FALSE)","v":true},"bInputsError","Check Error Messages (Red Text)","errInputsError"]
[null,"SPA errors (FALSE=OK)",{"$f":"OR(bSexError,'SPD Calculations_Hide'!bDOBError)","v":true},"bSPAErrors","Check Sex or DOB","errSPA"]
[null,"Expiration (FALSE=OK)",{"$f":"IF(dayExpiry<dayToday,TRUE,FALSE)","v":false},"bExpiryError",{"$f":"\"Tool Expired on \"&TEXT(dayExpiry,\"dd/mm/yyyy\")&\" please contact MyCSP for a new copy. \"","v":"Tool Expired on 01/04/2023 please contact MyCSP for a new copy. "},"_errExpiration"]
[null,"Version (FALSE=OK)",{"$f":"IF(VersionNumber<>MAX(tabVersionRange),TRUE,FALSE)","v":false},"bVersionError","Check Version Number.","_errVersion"]
[]
[null,"Service table error  (FALSE=OK)",{"$f":"IF(AND(PrevMemCS=\"N\",PrevMemPS=\"N\"),FALSE,IF(OR(tabPCErrors),TRUE,FALSE))","v":true},"bServiceTableError","Check Service Table","errServiceTableError"]
{"$rows_left_out":106}
{"sheet":"Cover Sheet_hide","index":6,"n_rows":28,"n_cols":11,"rows_kept":28,"cut":false,"hidden":true,"merged":[[1,1,7,10],[10,1,10,10]]}
[]
[null,"MyCSP\nSCU\nPension Questionnaire and Joiner Tool\nName : Joiner.xlsm"]
[]
[]
[]
[]
[]
[]
[]
[]
[null,{"$f":"msgSecurityClassification","v":"Security Classification: Unclassified.  "}]
[]
[]
[null,"Revision History"]
[null,"Version ","Name of file","Previous Version","Date","Author ","Team ","Description","Reviewed By, Name","Review Date","Review Comments and sign off"]
[null,0.1,"MYCSP","MYCSP","MYCSP","MYCSP","MYCSP","Version History V1.0.4 18022015.docx","MYCSP","MYCSP"]
[null,0.14000000000000001,"MYCSP","MYCSP","MYCSP","MYCSP","MYCSP","Version History V1.0.4 18022015.docx","MYCSP","MYCSP"]
[null,0.55000000000000004,"MYCSP","MYCSP","MYCSP","MYCSP","MYCSP","Version History V1.0.4 18022015.docx","MYCSP","MYCSP"]
[null,0.63,"MYCSP","MYCSP","MYCSP","MYCSP","MYCSP","Version History V1.0.4 18022015.docx","MYCSP","MYCSP"]
[null,0.68,"MYCSP","MYCSP","MYCSP","MYCSP","MYCSP","Version History V1.0.4 18022015.docx","MYCSP","MYCSP"]
{"$rows_left_out":9}
{"sheet":"Email Templates","index":7,"n_rows":2,"n_cols":16,"rows_kept":2,"cut":false,"hidden":true,"merged":[]}
["Premium",null,"Alpha"]
["Congratulations on your recent appointment within the Civil Service.\n\nA career in the Civil Service offers you a range of opportunities and benefits, including membership in the Civil Service pension scheme. \n\nI’m pleased to inform you that you’re eligible to join either:\n\n•\tthe premium scheme; or \n•\tthe partnership scheme. \n\nWhat to do next\n\n1.\tYou have been automatically enrolled into the premium pension scheme however you have a choice in which scheme you want to join. To help you decide, please read premium or partnership: an overview: https://tinyurl.com/ydkaadna.\n\n2.\tLet <INSERT RECRUITMENT CONTACT> know by completing and returning a Pension Choices form: https://tinyurl.com/52srnjtc.\n\nImportant: if you join premium, your partner may be eligible to receive a partner’s pension in the event of your death. It isn’t mandatory, but you can provide your partner’s details by completing a Partner Details form: https://tinyurl.com/cyh2uwu8 which will help Civil Service Pensions to determine your partner’s eligibility. \n\n3.\tYou may be able to transfer pension benefits into your Civil Service pension. For more information, email Civil Service Pensions at newjoiners@mycsp.co.uk.\n\nKind regards","Congratulations on your recent appointment within the Civil Service. \n\nA career in the Civil Service offers you a range of opportunities and benefits, including membership in the Civil Service pension scheme. \n\nI’m pleased to inform you that you’re eligible to join either:\n\n•\tthe nuvos scheme; or \n•\tthe partnership scheme. \n\nWhat to do next\n\n1.\tYou have been automatically enrolled into the nuvos pension scheme however you have a choice in which scheme you want to join. To help you decide, please read nuvos or partnership: an overview: https://tinyurl.com/3evuxtjm.\n\n2.\tLet <INSERT RECRUITMENT CONTACT> know by completing and returning a Pension Choices form: https://tinyurl.com/2du792p6.\n\nImportant: if you join nuvos, your partner may be eligible to receive a partner’s pension in the event of your death. It isn’t mandatory, but you can provide your partner’s details by completing a Partner Details form: https://tinyurl.com/cyh2uwu8 which will help Civil Service Pensions to determine your partner’s eligibility.\n\n3.\tYou may be able to transfer (previously built up) pension benefits into your Civil Service pension. For more information, please email Civil Service Pensions at newjoiners@mycsp.co.uk.\n\nKind regards","Congratulations on your recent appointment within the Civil Service.\n\nA career in the Civil Service offers you a range of opportunities and benefits, including membership in the Civil Service pension scheme. \n\nI’m pleased to inform you that you’re eligible to join either:\n\n•           the alpha scheme; or\n•           the partnership scheme. \n\nWhat to do next:\n\n1.        You have been automatically enrolled into the alpha pension scheme however you have a choice in which scheme you want to join. To help you decide, please read alpha or partnership: an overview: https://www.civilservicepensionscheme.org.uk/joining-the-pension-scheme/alpha-or-partnership/.\n\n2.         Let <INSERT RECRUITMENT CONTACT> know by completing and returning a Pension Choices form: https://www.civilservicepensionscheme.org.uk/media/g4ffzir1/new-starter_alpha-june-2021-25062021.pdf.\n\nImportant: if you join alpha, your partner may be eligible to receive a partner’s pension in the event of your death. It isn’t mandatory, but you can provide your partner’s details by completing a Partner Details form: https://www.civilservicepensionscheme.org.uk/media/fxwiou0k/partner-details-form-june-2018.pdf which will help Civil Service Pensions to determine your partner’s eligibility.\n\n3.         You may be able to transfer (previously built up) pension benefits into your Civil Service pension. A transfer-in application form can be found here: https://www.civilservicepensionscheme.org.uk/media/zgwnvndg/transfer-in-application-form.pdf\n    \nKind regards",null,null,null,null,"Dear test,\n\nCongratulations on your recent appointment within the Civil Service.\n\nA career in the Civil Service offers you a range of opportunities and benefits, including membership in the Civil Service pension scheme. \n\nI’m pleased to inform you that you’re eligible to join either:\n\n•           the alpha scheme; or\n•           the partnership scheme. \n\nWhat to do next:\n\n1.        You have been automatically enrolled into the alpha pension scheme however you have a choice in which scheme you want to join. To help you decide, please read alpha or partnership: an overview: https://tinyurl.com/4342akey.\n\n2.         Let <INSERT RECRUITMENT CONTACT> know by completing and returning a Pension Choices form: https://tinyurl.com/29nmbk5x.\n\nImportant: if you join alpha, your partner may be eligible to receive a partner’s pension in the event of your death. It isn’t mandatory, but you can provide your partner’s details by completing a Partner Details form: https://tinyurl.com/cyh2uwu8 which will help Civil Service Pensions to determine your partner’s eligibility.\n\n3.         You may be able to transfer (previously built up) pension benefits into your Civil Service pension. For more information, please email Civil Service Pensions at newjoiners@mycsp.co.uk.\n    \nKind regards",null,null,null,null,null,null,null,"Congratulations on your recent appointment.\n\nA career in the Civil Service offers you a range of opportunities and benefits, including access to the Civil Service pension scheme. Therefore, I’m pleased to inform you that you are eligible to join either of the following schemes:\n\n    - premium; or\n    - partnership\n\nWhat to do next:\n\n     1. Choose which scheme to join. To help you decide, please read Premium or Partnership: An Overview, found here: http://mycsp.co.uk/test.\n\n     2. Inform Civil Service Pensions of your choice by completing and returning the Pension Choices form in your New Joiner Pack (attached). \n\nImportant: if you join the premium scheme you can nominate your partner to receive a partner’s pension in the event of your death. To do this, complete and return the Partner Details form (attached). \n\n     3. Transfer a pension from previous employment. If you’ve previously worked for an employer covered by the Civil Service pension arrangements, you may be able to transfer in a pension. For more information email Civil Service Pensions at contactcentre@mycsp.co.uk   \n    \nKind regards\n"]