{"text_format":"1","workbook":"xlsx","n_sheets":8,"sheets":["Guidance","Pensions Questionnaire","Joiner Calculations_hide","SPD Calculations_Hide","PresenceCheck_Calculations","System Calcs,Assump,Table_hide","Cover Sheet_hide","Email Templates"],"not_rendered":{"charts":0,"images":2,"macros":1,"external_links":0,"defined_names":221,"comments":4,"pivot_tables":0},"unopened":[],"bounds":{"document_bytes":16777216,"sheet_cells":100000,"rows_first":2000,"rows_last":500,"rows_between":2000,"halvings":0,"cell_chars":16384,"cell_head_chars":4096},"cells_cut":0,"cells_raw":0,"read":"row_number_cap","date_system":"1900"}

{"sheet":"Guidance","index":0,"n_rows":5,"n_cols":2,"rows_kept":5,"cut":false,"hidden":false,"merged":[[0,1,2,11],[4,1,4,11]]}
[null,"Joiner Tool"]
[]
[]
[]
[null,"Welcome to the Joiner Tool – Civil Service Pension Schemes - classic, classic plus, premium, alpha\n"]

{"sheet":"Pensions Questionnaire","index":1,"n_rows":162,"n_cols":27,"rows_kept":162,"cut":false,"hidden":false,"merged":[[63,1,63,3],[63,4,63,7],[64,1,64,3],[38,4,38,7],[39,4,39,7],[46,4,46,7],[64,4,64,7],[57,2,57,12],[58,1,58,6],[48,1,48,6],[49,4,49,7],[49,1,49,3],[55,2,55,12],[56,2,56,12],[43,4,43,7],[59,1,59,12],[60,1,60,3],[60,4,60,7],[61,1,61,3],[61,4,61,7],[62,1,62,3],[62,4,62,7],[40,4,40,7],[41,4,41,7],[42,4,42,7],[53,2,53,12],[44,4,44,7],[45,4,45,7],[51,1,51,6],[52,2,52,12],[54,2,54,12],[0,1,2,12],[7,4,7,7],[9,4,9,7],[20,4,20,7],[11,4,11,7],[13,4,13,7],[15,4,15,7],[23,4,23,7],[17,4,17,7],[21,4,21,7],[17,1,17,3],[23,1,23,3],[22,1,22,3],[21,1,21,3],[20,1,20,3],[3,1,3,12],[19,1,19,12],[92,1,92,3],[106,1,106,3],[94,1,94,3],[96,1,96,3],[98,1,98,3],[149,1,149,3],[112,1,112,12],[141,1,141,3],[142,1,142,3],[143,1,143,3],[144,1,144,3],[145,1,145,3],[146,1,146,3],[147,1,147,3],[148,1,148,3],[133,1,133,3],[133,4,133,12],[115,4,115,12],[117,4,117,12],[119,4,119,12],[106,4,106,7],[121,4,121,12],[123,4,123,12],[90,1,90,3],[74,4,74,7],[74,1,74,3],[160,1,160,12],[158,1,158,12],[115,1,115,3],[117,1,117,3],[119,1,119,3],[121,1,121,3],[123,1,123,3],[125,1,125,3],[127,1,127,3],[129,1,129,3],[131,1,131,3],[157,1,157,12],[159,1,159,12],[156,1,156,12],[155,1,155,12],[92,4,92,7],[94,4,94,7],[96,4,96,7],[98,4,98,7],[78,4,78,7],[102,1,102,3],[25,1,25,3],[22,4,22,7],[30,1,30,13],[36,4,36,7],[37,4,37,7],[24,4,24,7],[26,4,26,9],[25,4,25,9],[24,1,24,3],[27,4,27,9],[27,1,27,3],[29,1,29,12],[34,0,34,12],[31,1,31,12],[32,2,32,12],[33,1,33,3],[33,4,33,7],[26,1,26,3],[88,1,88,3],[78,1,78,3],[80,1,80,3],[84,1,84,3],[69,1,69,13],[70,2,70,12],[65,1,65,3],[65,4,65,7],[66,1,66,3],[66,4,66,7],[67,1,67,3],[67,4,67,7],[76,4,76,7],[76,1,76,3],[72,4,72,7],[5,1,5,12],[108,1,108,3],[108,4,108,7],[125,4,125,12],[127,4,127,12],[129,4,129,12],[131,4,131,12],[136,4,136,12],[137,4,137,12],[21,9,21,12],[22,9,22,12],[100,4,100,7],[90,4,90,7],[80,4,80,7],[82,4,82,7],[84,4,84,7],[82,1,82,3],[104,1,104,3],[100,1,100,3],[102,4,102,7],[104,4,104,7],[86,4,86,7],[88,4,88,7],[86,1,86,3]],"read":"row_number_cap"}
[null,{"$f":"strToolName","v":"Joiner Tool"}]
[]
[null,null,null,null,null,null,null,null,null,null,null,null,null,null,null,null,null,null,null,null,null,null,null,null,"Top section error count",{"$f":"SUM(Z7:Z52)","v":7}]
[null,"Stage 1 - Member's details",null,null,null,null,null,null,null,null,null,null,null,null,null,null,null,null,"Display and Look Up data",null,"uiErrorCount",null,null,null,"erro Count",{"$f":"SUM(Z7:Z137)","v":7},"uiErrorCount"]
["hide",null,null,null,null,null,null,null,"Error column","Message column",null,null,null,null,null,null,null,null,"Question Code","Required field?","Result Name or reference name","Result","Display if dependent on other values?","Result Found","Error Message","ErrorCount","Notes"]
[null,"You should use this tool for new appointments that will commence on, or after, 1 April 2015. This tool will tell you the correct scheme (including the new scheme, alpha) to enrol the employee into to ensure they receive the relevant starter pack and information.\nPlease complete the stages in numerical order. Stages will expand and collapse as you work your way through the form."]
[null,null,null,null,null,null,null,null,null,null,null,null,null,null,null,null,null,null,null,null,null,{"$f":"IF(S7<>\"\",E7,\"\")","v":""},null,null,null,{"$f":"IF(Y7<>\"\",1,0)","v":0}]
[null,null,null,"Name : ",null,null,null,null,{"$f":"IF(tabErrorMessage<>\"\",tabErrorMessage,\"\")","v":"Enter Value"},null,null,null,null,null,null,null,null,null,null,"y","uiName",{"$f":"IF(S8<>\"\",E8,\"\")","v":""},true,null,{"$f":"IF(AND(E8=\"\",W8=TRUE),\"Enter Value\",\"\")","v":"Enter Value"},{"$f":"IF(Y8<>\"\",1,0)","v":1}]
[null,null,null,null,null,null,null,null,null,null,null,null,null,null,null,null,null,null,null,null,null,"",null,null,null,0]
[null,null,null,"National Insurance number : ",null,null,null,null,{"$f":"IF(tabErrorMessage<>\"\",tabErrorMessage,\"\")","v":"Enter Value"},null,null,null,null,null,null,null,null,null,null,"y","uiNINO","",true,null,{"$f":"IF(AND(E10=\"\",W10=TRUE),\"Enter Value\",\"\")","v":"Enter Value"},1]
[null,null,null,null,null,null,null,null,null,null,null,null,null,null,null,null,null,null,null,null,null,"",null,null,null,0]
[null,null,null,"Date of birth : ",null,null,null,null,{"$f":"IF(tabErrorMessage<>\"\",tabErrorMessage,\"\")","v":"Enter Value"},null,null,null,null,null,null,null,null,null,null,"y","uiDOB","",true,null,{"$f":"IF(AND(E12=\"\",W12=TRUE),\"Enter Value\",\"\")","v":"Enter Value"},1,"Data gathering as per original"]
[null,null,null,null,null,null,null,null,null,null,null,null,null,null,null,null,null,null,null,null,null,"",null,null,null,0]
[null,null,null,"Start date of new period of service : ",null,null,null,null,{"$f":"IF(tabErrorMessage<>\"\",tabErrorMessage,\"\")","v":"Enter Value"},null,null,null,null,null,null,null,null,null,null,"y","uiStartDate","",true,null,{"$f":"IF(AND(E14=\"\",W14=TRUE),\"Enter Value\",\"\")","v":"Enter Value"},1]
[null,null,null,null,null,null,null,null,null,null,null,null,null,null,null,null,null,null,null,null,null,"",{"$f":"IF(U15<>\"\",F15,\"\")","v":""},null,null,0]
[null,null,null,"Gender : ",null,null,null,null,{"$f":"IF(tabErrorMessage<>\"\",tabErrorMessage,\"\")","v":"Enter Value"},null,null,null,null,null,null,null,null,null,{"$f":"62+65-15","v":112},null,"uiSex",{"$f":"IF(S16<>\"\",E16,\"\")","v":0},true,null,{"$f":"IF(AND(E16=\"\",W16=TRUE),\"Enter Value\",\"\")","v":"Enter Value"},1]
[null,null,null,null,null,null,null,null,null,null,null,null,null,null,null,null,null,null,null,null,null,null,null,null,null,0]
[null,"Member's State Pension age based on current legislation at date of calculation:",null,null,{"$f":"ressSPA","v":""},null,null,null,null,null,null,null,null,null,null,null,null,null,{"$f":"YEAR((DATE(YEAR(uiDOB)+65,MONTH(uiDOB),DAY(uiDOB))))-YEAR(DATE(2012,1,1))","v":-48},null,null,{"$f":"IF(S18<>\"\",E18,\"\")","v":""},true,null,null,0]
[null,null,null,null,null,null,null,null,null,null,null,null,null,null,null,null,null,null,null,null,null,null,null,null,null,0]
[null,"Stage 2 - Member's Public and Civil Service pension history",null,null,null,null,null,null,null,null,null,null,null,null,null,null,null,null,null,null,null,"","",null,null,0]
[null,{"$f":"HLOOKUP(S21,tabQuestionCode,2,0)","v":"Has the member ever been a member of the Civil Service Pension arrangements?"},null,null,null,null,null,null,{"$f":"IF(tabErrorMessage<>\"\",tabErrorMessage,\"\")","v":"Enter Value"},null,null,null,null,null,null,null,null,null,"A0","y","uiPrevMemCS",{"$f":"IF(S21<>\"\",E21,\"\")","v":0},true,null,{"$f":"IF(AND(W21=FALSE,E21<>\"\"),\"Error, remove value\",IF(AND(E21=\"\",W21=TRUE),\"Enter Value\",\"\"))","v":"Enter Value"},1]
[null,{"$f":"HLOOKUP(S22,tabQuestionCode,2,0)","v":"Has the member ever been a member of the public service pension arrangements?"},null,null,null,null,null,null,{"$f":"IF(tabErrorMessage<>\"\",tabErrorMessage,\"\")","v":"Enter Value"},"http://www.legislation.gov.uk/ukpga/2013/25/schedule/1",null,null,null,null,null,null,null,null,"A1","y","uiPrevMemPS",{"$f":"IF(S22<>\"\",E22,\"\")","v":0},true,"Only part of logic if CSP =N",{"$f":"IF(AND(W22=FALSE,E22<>\"\"),\"Error, remove value\",IF(AND(E22=\"\",W22=TRUE),\"Enter Value\",\"\"))","v":"Enter Value"},1]
[null,"Was the Civil Service Pension Scheme 'by analogy'?",null,null,null,null,null,null,{"$f":"IF(tabErrorMessage<>\"\",tabErrorMessage,\"\")","v":""},"http://www.civilservicepensionscheme.org.uk/about-us/by-analogy-and-analogous-schemes/",null,null,null,null,null,null,null,null,null,null,"uiByAnalogy",null,{"$f":"IF(uiPrevMemCS=\"Y\",IF(bfound,\"Found\",TRUE),FALSE)","v":false},null,{"$f":"IF(AND(W23=FALSE,E23<>\"\"),\"Error, remove value\",IF(AND(E23=\"\",W23=TRUE),\"Enter Value\",\"\"))","v":""},0]
[null,{"$f":"IF(uiByAnalogy=\"Y\",\"What was the by anology equivalent scheme?\",\"What Civil Service Pension Scheme was the member in?\")","v":"What Civil Service Pension Scheme was the member in?"},null,null,null,null,null,null,{"$f":"IF(tabErrorMessage<>\"\",tabErrorMessage,\"\")","v":""},null,null,null,null,null,null,null,null,null,null,null,"uiCSScheme",{"$f":"IF(S24<>\"\",E24,\"\")","v":""},{"$f":"IF(uiPrevMemCS=\"Y\",IF(bfound,\"Found\",TRUE),FALSE)","v":false},null,{"$f":"IF(AND(W24=FALSE,E24<>\"\"),\"Error, remove value\",IF(AND(E24=\"\",W24=TRUE),\"Enter Value\",\"\"))","v":""},0]
[null,"The member's previous Civil Service Scheme has a pension age of :",null,null,{"$f":"resPrevSchemeNPACS","v":""},null,null,null,null,null,null,null,null,null,null,null,null,null,null,null,null,null,{"$f":"IF(uiPrevMemCS=\"Y\",IF(bfound,\"Found\",TRUE),FALSE)","v":false},null,null,0]
[null,"Who was the member's most recent employer when they were in the Civil Service Pension Scheme?  Enter as many details as required.",null,null,null,null,null,null,null,null,null,null,null,null,null,null,null,null,null,null,"uiCSEmployer",{"$f":"IF(S26<>\"\",E26,\"\")","v":""},{"$f":"IF(uiPrevMemCS=\"Y\",IF(bfound,\"Found\",TRUE),FALSE)","v":false},null,null,0,"Data gathering as per original"]
[null,"Who was the member's most recent employer when they were in the public service pension scheme?  Enter as many details as required.",null,null,"ENTER PUBLIC SERVICE EMPLOYER DETAILS",null,null,null,null,null,null,null,null,null,null,null,null,null,null,null,"uiPSEmployer",{"$f":"IF(S27<>\"\",E27,\"\")","v":""},{"$f":"IF(uiPrevMemPS=\"Y\",IF(bfound,\"Found\",TRUE),FALSE)","v":false},null,null,0,"Data gathering as per original"]
[null,"When the member was in partnership, which provider did they choose?  Enter as many details as required.",null,null,"ENTER PROVIDER DETAILS",null,null,null,{"$f":"IF(tabErrorMessage<>\"\",tabErrorMessage,\"\")","v":""},null,null,null,null,null,null,null,null,null,null,null,"uiPartnership",{"$f":"IF(S28<>\"\",E28,\"\")","v":""},{"$f":"IF(OR(uiCSScheme=INDEX(tabSchemeList,6),uiCSScheme=INDEX(tabSchemeList,8)),IF(bfound,\"Found\",TRUE),FALSE)","v":false},null,null,0,"Data gathering as per original"]
[null,null,null,null,null,null,null,null,null,null,null,null,null,null,null,null,null,null,null,null,null,null,null,null,null,0]
[null,"Stage 3 - Public and Civil Service pension history",null,null,null,null,null,null,null,null,null,null,null,null,null,null,null,null,null,null,null,null,null,null,null,0]
[null,"As the member has previously been a member of a Civil Service or public service pension scheme, they may be entitled to re-join the Part 1 section of the PCSPS.  Whether a member joins the PCSPS or alpha depends on their pension service history and when they were in the Civil Service and/or public service pension schemes.  Enter the member's pension service history in the table below.  This will end on the day the member is to start their new position with a Civil Service Pension Scheme employer.  The first service period should include the date 1/4/2007 or if the member started work later than this,  their first period of employment. ",null,null,null,null,null,null,null,null,null,null,null,null,null,null,null,null,null,null,null,null,{"$f":"uiServHistTableShow","v":false},null,null,0]
[null,"Important Note Previous Public Service Note",null,null,null,null,null,null,null,null,null,null,null,null,null,null,null,null,null,null,"uiShowPSNote",null,{"$f":"IF(AND(resPrevSchemeAlpha=\"N\",OR(PrevMemPS=\"Y\")),IF(bfound,\"Found\",TRUE),FALSE)","v":false},null,null,0]
[null,null,"The tool should not be used if the member has had any of the following :  \n1 - Transfer Out\n2 - Benefit put in to payment\n3 - Refunded\n4 - Were not offered some degree of tapered or full protection in previous Public Sector Employment.\n5 - Were offered some degree of tapered or full protection and in previous Public Sector Employment, and did not relinquish that protection.",null,null,null,null,null,null,null,null,null,null,null,null,null,null,null,null,null,null,null,{"$f":"uiShowPSNote","v":false},null,null,0]
[null,"Confirm that the member is applicable to continue, (Y) confirms the member has not had any of the above, (N) confirms the member's public service pension has had one of the above.",null,null,null,null,null,null,{"$f":"IF(tabErrorMessage<>\"\",tabErrorMessage,\"\")","v":""},null,null,null,null,null,null,null,null,null,null,null,"uiPSConfirmation",{"$f":"IF(S34<>\"\",E34,\"\")","v":""},{"$f":"uiShowPSNote","v":false},null,{"$f":"IF(AND(W34=FALSE,E34<>\"\"),\"Error, remove value\",IF(AND(E34=\"\",W34=TRUE),\"Enter Value\",\"\"))","v":""},0]
[null,null,null,null,null,null,null,null,null,null,null,null,null,null,null,null,null,null,null,null,null,null,{"$f":"uiShowPSNote","v":false},null,null,0]
[null,null,null,null,null,null,null,null,null,null,null,null,null,null,null,null,null,null,null,null,"uiServHistTableShow",null,{"$f":"IF(uiPSConfirmation=\"N\",FALSE,IF(AND(resPrevSchemeAlpha=\"N\",OR(PrevMemCS=\"Y\",PrevMemPS=\"Y\")),IF(bfound,\"Found\",TRUE),FALSE))","v":false},null,null,0]
[null,null,null,"Start date","End date",null,null,null,"Employment type","Break status at key dates",{"$f":"\"Messages\"","v":"Messages"},null,null,null,null,null,null,null,null,null,null,null,{"$f":"uiServHistTableShow","v":false},null,null,0]
[null,null,"Pension history 1 ",null,null,null,null,null,null,{"$f":"IF(K38=\"(2012) \",strBreakStatusFull2012,\"\")&\nIF(K38=\"(2012) (2015) \",\"2012-\"&strBreakStatusFull2012&\" \"&\"2015-\"&strBreakStatusFull2015,\"\")&\nIF(K38=\"(2015) \",strBreakStatusFull2015,\"\")","v":""},{"$f":"IF(W38=FALSE,\"\",IF(AND(W38<>\"FALSE\",Y38=\"\"),PresenceCheck_Calculations!F27,Y38))","v":""},null,null,null,null,null,null,null,null,null,"uitabPensionHistory",{"$f":"IF(S38<>\"\",E38,\"\")","v":""},false,null,{"$f":"IF(AND(W38=FALSE,OR(E38<>\"\",uitabPensionHistoryFirst<>\"\",I38<>\"\")),\"Error, Clear Table\",IF(AND(E38=\"\",W38=TRUE),\"\",\"\"))","v":""},0]
[null,null,"Pension history 2 ",{"$f":"IF(AND(E38<>\"\",E38<uiStartDate-1),E38+1,\"\")","v":""},null,null,null,null,null,{"$f":"IF(K39=\"(2012) \",strBreakStatusFull2012,\"\")&\nIF(K39=\"(2012) (2015) \",\"2012-\"&strBreakStatusFull2012&\" \"&\"2015-\"&strBreakStatusFull2015,\"\")&\nIF(K39=\"(2015) \",strBreakStatusFull2015,\"\")","v":""},{"$f":"IF(W39=FALSE,\"\",IF(AND(W39<>\"FALSE\",Y39=\"\"),PresenceCheck_Calculations!F28,Y39))","v":""},null,null,null,null,null,null,null,null,null,null,"",false,null,{"$f":"IF(AND(W39=FALSE,OR(E39<>\"\",I39<>\"\")),\"Error, Clear Table\",IF(AND(E39=\"\",W39=TRUE),\"\",\"\"))","v":""},0]
[null,null,"Pension history 3 ",{"$f":"IF(AND(E39<>\"\",E39<uiStartDate-1),E39+1,\"\")","v":""},null,null,null,null,null,{"$f":"IF(K40=\"(2012) \",strBreakStatusFull2012,\"\")&\nIF(K40=\"(2012) (2015) \",\"2012-\"&strBreakStatusFull2012&\" \"&\"2015-\"&strBreakStatusFull2015,\"\")&\nIF(K40=\"(2015) \",strBreakStatusFull2015,\"\")","v":""},{"$f":"IF(W40=FALSE,\"\",IF(AND(W40<>\"FALSE\",Y40=\"\"),PresenceCheck_Calculations!F29,Y40))","v":""},null,null,null,null,null,null,null,null,null,null,"",false,null,{"$f":"IF(AND(W40=FALSE,OR(E40<>\"\",I40<>\"\")),\"Error, Clear Table\",IF(AND(E40=\"\",W40=TRUE),\"\",\"\"))","v":""},0]
[null,null,"Pension history 4 ","",null,null,null,null,null,"",{"$f":"IF(W41=FALSE,\"\",IF(AND(W41<>\"FALSE\",Y41=\"\"),PresenceCheck_Calculations!F30,Y41))","v":""},null,null,null,null,null,null,null,null,null,null,"",false,null,"",0]
[null,null,"Pension history 5 ","",null,null,null,null,null,"",{"$f":"IF(W42=FALSE,\"\",IF(AND(W42<>\"FALSE\",Y42=\"\"),PresenceCheck_Calculations!F31,Y42))","v":""},null,null,null,null,null,null,null,null,null,null,"",false,null,"",0]
[null,null,"Pension history 6 ","",null,null,null,null,null,"",{"$f":"IF(W43=FALSE,\"\",IF(AND(W43<>\"FALSE\",Y43=\"\"),PresenceCheck_Calculations!F32,Y43))","v":""},null,null,null,null,null,null,null,null,null,null,"",false,null,"",0]
[null,null,"Pension history 7 ","",null,null,null,null,null,"",{"$f":"IF(W44=FALSE,\"\",IF(AND(W44<>\"FALSE\",Y44=\"\"),PresenceCheck_Calculations!F33,Y44))","v":""},null,null,null,null,null,null,null,null,null,null,"",false,null,"",0]
[null,null,"Pension history 8 ","",null,null,null,null,null,"",{"$f":"IF(W45=FALSE,\"\",IF(AND(W45<>\"FALSE\",Y45=\"\"),PresenceCheck_Calculations!F34,Y45))","v":""},null,null,null,null,null,null,null,null,null,null,"",false,null,"",0]
[null,null,"Pension history 9 ","",null,null,null,null,null,"",{"$f":"IF(W46=FALSE,\"\",IF(AND(W46<>\"FALSE\",Y46=\"\"),PresenceCheck_Calculations!F35,Y46))","v":""},null,null,null,null,null,null,null,null,null,null,"",false,null,"",0]
[null,null,"Pension history 10 ","",null,null,null,null,null,"",{"$f":"IF(W47=FALSE,\"\",IF(AND(W47<>\"FALSE\",Y47=\"\"),PresenceCheck_Calculations!F36,Y47))","v":""},null,null,null,null,null,null,null,null,null,null,"",false,null,"",0]
[null,null,null,null,null,null,null,null,null,null,null,null,null,null,null,null,null,null,null,null,null,null,null,null,null,0]
[null,"Summary of eligibility",null,null,null,null,null,null,null,null,null,null,null,null,null,null,null,null,null,null,null,null,{"$f":"IF(AND(resPrevSchemeAlpha=\"Y\",res2012PresenceCheck=\"Y\",resLT13p5=\"Y\",resLT10=\"N\"),TRUE,FALSE)","v":false},null,null,0]
[null,{"$f":"IF(S50<>\"\",HLOOKUP(S50,tabQuestionCode,2,0),\"\")","v":"As the member was in Civil Service at 31/3/2012 they should have taken part in the Options Exercise.  Did the member opt to move on their Taper Date (Y)?"},null,null,null,null,null,null,{"$f":"IF(tabErrorMessage<>\"\",tabErrorMessage,\"\")","v":""},null,null,null,null,null,null,null,null,null,"E","y","resTaper",{"$f":"IF(AND(uiPrevMemPS=\"Y\",uiPrevMemCS=\"N\"),\"N\",\nIF(AND(uiPrevMemPS=\"N\",uiPrevMemCS=\"N\"),\"N\",\nIF(res2012PresenceCheck=\"N\",\"N\",\nIF(S50<>\"\",IF(resTaper=\"\",\"Y\",resTaper),\"Y\"))))","v":"Y"},{"$f":"IF(OR(uiShowPSNote=\"found\",uiShowPSNote),FALSE,IF(AND(res2012PresenceCheck=\"Y\",resLT13p5=\"Y\",resLT10=\"N\"),TRUE,FALSE))","v":false},null,{"$f":"IF(AND(E50<>\"\",W50=FALSE),\"Error, remove value\",IF(AND(E50=\"\",W50=TRUE),\"Enter Value\",IF(AND(resTaper=\"Y\",uiCSScheme<>\"alpha\"),\"\",\"\")))","v":""},0]
[null,null,null,null,null,null,null,null,null,null,null,null,null,null,null,null,null,null,null,null,{"$f":"IF(resTaper=\"Y\",\"N\",\"\")&IF(resTaper=\"N\",\"Y\",\"\")","v":""},{"$f":"IF(S51<>\"\",IF(resTaper=\"\",\"N\",E51),\"N\")","v":"N"},null,null,null,0]
[null,"Summary of eligibility",null,null,null,null,null,null,null,null,null,null,null,null,null,null,null,null,null,null,null,null,{"$f":"uiServHistTableShow","v":false},null,null,0]
[null,null,"Member joins alpha.",null,null,null,null,null,null,null,null,null,null,null,null,null,null,null,null,null,null,null,{"$f":"uiServHistTableShow","v":false},null,null,0]
[null,null,null,null,null,null,null,null,null,null,null,null,null,null,null,null,null,null,null,null,null,null,false,null,null,0]
[null,null,null,null,null,null,null,null,null,null,null,null,null,null,null,null,null,null,null,null,null,null,false,null,null,0]
[null,null,null,null,null,null,null,null,null,null,null,null,null,null,null,null,null,null,null,null,null,null,false,null,null,0]
[null,null,null,null,null,null,null,null,null,null,null,null,null,null,null,null,null,null,null,null,null,null,false,null,null,0]
[null,null,null,null,null,null,null,null,null,null,null,null,null,null,null,null,null,null,null,null,null,null,false,null,null,0]
["h","Calculated JOINER results (HIDDEN SECTION)",null,null,null,null,null,null,null,null,null,null,null,null,null,null,null,null,null,null,null,null,null,null,null,0]
["h","These are calculated values based on previous responses, they are calculated in Calculation Sheet.  These must have N as default values.",null,null,null,null,null,null,null,null,null,null,null,null,null,null,null,null,null,null,null,null,null,null,null,0]
["h",{"$f":"IF(S61<>\"\",HLOOKUP(S61,tabQuestionCode,2,0),\"\")","v":"Was the member previously in the alpha scheme?"},null,null,{"$f":"resPrevSchemeAlpha","v":"N"},null,null,null,"Always required",null,null,null,null,null,null,null,null,null,"B",null,"resPrevSchemeAlpha",{"$f":"IF(S61<>\"\",E61,\"\")","v":"N"},null,null,null,0]
["h","Was the member in either public or civil service on 1/4/2012?",null,null,{"$f":"res2012PresenceCheck","v":""},null,null,null,"Calculated Value",null,null,null,null,null,null,null,null,null,"B2",null,"res2012PresenceCheck","",null,null,null,0]
["h","Was the member MORE THAN 13.5 years to the public or civil pension service NPA @ 1/4/2012",null,null,{"$f":"resLT13p5","v":""},null,null,null,"Calculated Value",null,null,null,null,null,null,null,null,null,"C",null,"resLT13p5","",null,null,null,0]
["h","Was the member LESS THAN 10 years to the public or civil pension service NPA @ 1/4/2012",null,null,{"$f":"resLT10","v":""},null,null,null,"Calculated Value",null,null,null,null,null,null,null,null,null,"D",null,"resLT10","",null,null,null,0]
["h","Is the member fully protected?",null,null,{"$f":"resFullyProtected","v":""},null,null,null,"Calculated Value",null,null,null,null,null,null,null,null,null,"F",null,"resFullyProtected","",null,null,null,0]
["h","Is the member's start date less than their Taper Date?",null,null,{"$f":"resSDateLTETEDate","v":""},null,null,null,"Calculated Value",null,null,null,null,null,null,null,null,null,"G",null,"resSDateLTETEDate","",null,null,null,0]
["h","Alpha rejoiner?",null,null,{"$f":"resAlphaReJoiner","v":"N"},null,null,null,"Calculated Value, always required",null,null,null,null,null,null,null,null,null,"0A",null,"resAlphaReJoiner","N",null,null,null,0]
["h","PCSPS rejoiner?",null,null,{"$f":"resPCSPCReJoiner","v":"N"},null,null,null,"Calculated Value, always required",null,null,null,null,null,null,null,null,null,"0B",null,"resPCSPCReJoiner","N",null,null,null,0]
[null,null,null,null,null,null,null,null,null,null,null,null,null,null,null,null,null,null,null,null,null,{"$f":"IF(S69<>\"\",E69,\"\")","v":""},{"$f":"IF(U69<>\"\",F69,\"\")","v":""},{"$f":"IF(U69<>\"\",F69,\"\")","v":""},"",0]
[null,"Stage 4 - Re-joining Status ",null,null,null,null,null,null,null,null,null,null,null,null,null,null,null,null,null,null,null,null,null,null,null,0]
[null,null,{"$f":"IF(uiErrorCountTop>0,errInputsError,resRejoinerStatusMessage)","v":"Check Error Messages (Red Text)"},null,null,null,null,null,null,null,null,null,null,null,null,null,null,null,null,null,null,null,null,null,null,0]
[null,null,null,null,null,null,null,null,null,null,null,null,null,null,null,null,null,null,null,null,null,{"$f":"IF(S72<>\"\",E72,\"\")","v":""},{"$f":"IF(U72<>\"\",F72,\"\")","v":""},{"$f":"IF(U72<>\"\",F72,\"\")","v":""},"",{"$f":"IF(Y72<>\"\",1,0)","v":0}]
[null,null,null,"Questions","Response",null,null,null,null,null,null,null,null,null,null,null,null,null,null,null,null,{"$f":"IF(S73<>\"\",E73,\"\")","v":""},{"$f":"IF(U73<>\"\",F73,\"\")","v":""},null,null,0]
[null,null,null,null,null,null,null,null,null,null,null,null,null,null,null,null,null,null,null,null,null,"",{"$f":"IF(U74<>\"\",F74,\"\")","v":""},null,null,0]
[null,{"$f":"IF(S75<>\"\",HLOOKUP(S75,tabQuestionCode,2,0),\"\")","v":"Did the member resign from their previous service?"},null,null,null,null,null,null,{"$f":"IF(tabErrorMessage<>\"\",tabErrorMessage,\"\")","v":""},null,null,null,null,null,null,null,null,null,"1A",null,"ui1A",0,{"$f":"IF(resRejoiner,IF(ISERROR(HLOOKUP(S75,tabDisplayQuestion,2,0)),FALSE,HLOOKUP(S75,tabDisplayQuestion,2,0)),FALSE)","v":false},null,{"$f":"IF(AND(W75=FALSE,E75<>\"\"),\"Error, remove value\",IF(AND(E75=\"\",W75=TRUE),\"Enter Value\",\"\"))","v":""},0]
[null,null,null,null,null,null,null,null,null,null,null,null,null,null,null,null,null,null,null,null,null,"",{"$f":"IF(U76<>\"\",F76,\"\")","v":""},null,null,0]
[null,{"$f":"IF(S77<>\"\",HLOOKUP(S77,tabQuestionCode,2,0),\"\")","v":"Was the member dismissed due to inefficiency, end of fixed term contract or did their Fixed Term Appointment (FTA) end?"},null,null,null,null,null,null,{"$f":"IF(tabErrorMessage<>\"\",tabErrorMessage,\"\")","v":""},null,null,null,null,null,null,null,null,null,"1B",null,{"$f":"\"ui\"&S77","v":"ui1B"},0,{"$f":"IF(resRejoiner,IF(ISERROR(HLOOKUP(S77,tabDisplayQuestion,2,0)),FALSE,HLOOKUP(S77,tabDisplayQuestion,2,0)),FALSE)","v":false},null,{"$f":"IF(AND(W77=FALSE,E77<>\"\"),\"Error, remove value\",IF(AND(E77=\"\",W77=TRUE),\"Enter Value\",\"\"))","v":""},0]
[null,null,null,null,null,null,null,null,null,null,null,null,null,null,null,null,null,null,null,null,null,"",{"$f":"IF(U78<>\"\",F78,\"\")","v":""},null,null,0]
[null,{"$f":"IF(S79<>\"\",HLOOKUP(S79,tabQuestionCode,2,0),\"\")","v":"Did the take an approved early retirement (AER)?"},null,null,null,null,null,null,{"$f":"IF(tabErrorMessage<>\"\",tabErrorMessage,\"\")","v":""},null,null,null,null,null,null,null,null,null,"1C",null,{"$f":"\"ui\"&S79","v":"ui1C"},0,{"$f":"IF(resRejoiner,IF(ISERROR(HLOOKUP(S79,tabDisplayQuestion,2,0)),FALSE,HLOOKUP(S79,tabDisplayQuestion,2,0)),FALSE)","v":false},null,{"$f":"IF(AND(W79=FALSE,E79<>\"\"),\"Error, remove value\",IF(AND(E79=\"\",W79=TRUE),\"Enter Value\",\"\"))","v":""},0]
[null,null,null,null,null,null,null,null,null,null,null,null,null,null,null,null,null,null,null,null,null,"",{"$f":"IF(U80<>\"\",F80,\"\")","v":""},null,null,0]
[null,{"$f":"IF(S81<>\"\",HLOOKUP(S81,tabQuestionCode,2,0),\"\")","v":"Did the member take an age retirement? "},null,null,null,null,null,null,{"$f":"IF(tabErrorMessage<>\"\",tabErrorMessage,\"\")","v":""},null,null,null,null,null,null,null,null,null,"1D",null,{"$f":"\"ui\"&S81","v":"ui1D"},0,{"$f":"IF(resRejoiner,IF(ISERROR(HLOOKUP(S81,tabDisplayQuestion,2,0)),FALSE,HLOOKUP(S81,tabDisplayQuestion,2,0)),FALSE)","v":false},null,{"$f":"IF(AND(W81=FALSE,E81<>\"\"),\"Error, remove value\",IF(AND(E81=\"\",W81=TRUE),\"Enter Value\",\"\"))","v":""},0]
[null,null,null,null,null,null,null,null,null,null,null,null,null,null,null,null,null,null,null,null,null,"",{"$f":"IF(U82<>\"\",F82,\"\")","v":""},null,null,0]
[null,{"$f":"IF(S83<>\"\",HLOOKUP(S83,tabQuestionCode,2,0),\"\")","v":"Did the member take an ill-health retirement? "},null,null,null,null,null,null,{"$f":"IF(tabErrorMessage<>\"\",tabErrorMessage,\"\")","v":""},null,null,null,null,null,null,null,null,null,"1E",null,{"$f":"\"ui\"&S83","v":"ui1E"},0,{"$f":"IF(resRejoiner,IF(ISERROR(HLOOKUP(S83,tabDisplayQuestion,2,0)),FALSE,HLOOKUP(S83,tabDisplayQuestion,2,0)),FALSE)","v":false},null,{"$f":"IF(AND(W83=FALSE,E83<>\"\"),\"Error, remove value\",IF(AND(E83=\"\",W83=TRUE),\"Enter Value\",\"\"))","v":""},0]
[null,null,null,null,null,null,null,null,null,null,null,null,null,null,null,null,null,null,null,null,null,"",{"$f":"IF(U84<>\"\",F84,\"\")","v":""},null,null,0]
[null,{"$f":"IF(S85<>\"\",HLOOKUP(S85,tabQuestionCode,2,0),\"\")","v":"Did the member take an early retirement (ARR)? "},null,null,null,null,null,null,{"$f":"IF(tabErrorMessage<>\"\",tabErrorMessage,\"\")","v":""},null,null,null,null,null,null,null,null,null,"1F",null,{"$f":"\"ui\"&S85","v":"ui1F"},0,{"$f":"IF(resRejoiner,IF(ISERROR(HLOOKUP(S85,tabDisplayQuestion,2,0)),FALSE,HLOOKUP(S85,tabDisplayQuestion,2,0)),FALSE)","v":false},null,{"$f":"IF(AND(W85=FALSE,E85<>\"\"),\"Error, remove value\",IF(AND(E85=\"\",W85=TRUE),\"Enter Value\",\"\"))","v":""},0]
[null,null,null,null,null,null,null,null,null,null,null,null,null,null,null,null,null,null,null,null,null,"",{"$f":"IF(U86<>\"\",F86,\"\")","v":""},null,null,0]
[null,{"$f":"IF(S87<>\"\",HLOOKUP(S87,tabQuestionCode,2,0),\"\")","v":"Did the member leave WITH early leaver reserved rights? "},null,null,null,null,null,null,{"$f":"IF(tabErrorMessage<>\"\",tabErrorMessage,\"\")","v":""},null,null,null,null,null,null,null,null,null,"1G",null,{"$f":"\"ui\"&S87","v":"ui1G"},0,{"$f":"IF(resRejoiner,IF(ISERROR(HLOOKUP(S87,tabDisplayQuestion,2,0)),FALSE,HLOOKUP(S87,tabDisplayQuestion,2,0)),FALSE)","v":false},null,{"$f":"IF(AND(W87=FALSE,E87<>\"\"),\"Error, remove value\",IF(AND(E87=\"\",W87=TRUE),\"Enter Value\",\"\"))","v":""},0]
[null,null,null,null,null,null,null,null,null,null,null,null,null,null,null,null,null,null,null,null,null,"",{"$f":"IF(U88<>\"\",F88,\"\")","v":""},null,null,0]
[null,{"$f":"IF(S89<>\"\",HLOOKUP(S89,tabQuestionCode,2,0),\"\")","v":"Did the member leave WITHOUT early leaver reserved rights? "},null,null,null,null,null,null,{"$f":"IF(tabErrorMessage<>\"\",tabErrorMessage,\"\")","v":""},null,null,null,null,null,null,null,null,null,"1H",null,{"$f":"\"ui\"&S89","v":"ui1H"},0,{"$f":"IF(resRejoiner,IF(ISERROR(HLOOKUP(S89,tabDisplayQuestion,2,0)),FALSE,HLOOKUP(S89,tabDisplayQuestion,2,0)),FALSE)","v":false},null,{"$f":"IF(AND(W89=FALSE,E89<>\"\"),\"Error, remove value\",IF(AND(E89=\"\",W89=TRUE),\"Enter Value\",\"\"))","v":""},0]
[null,null,null,null,null,null,null,null,null,null,null,null,null,null,null,null,null,null,null,null,null,"",{"$f":"IF(U90<>\"\",F90,\"\")","v":""},null,null,0]
[null,{"$f":"IF(S91<>\"\",HLOOKUP(S91,tabQuestionCode,2,0),\"\")","v":"Did the member have more than two years' qualifying service? "},null,null,null,null,null,null,{"$f":"IF(tabErrorMessage<>\"\",tabErrorMessage,\"\")","v":""},null,null,null,null,null,null,null,null,null,1.5,null,{"$f":"\"ui\"&S91","v":"ui1.5"},0,{"$f":"IF(resRejoiner,IF(ISERROR(HLOOKUP(S91,tabDisplayQuestion,2,0)),FALSE,HLOOKUP(S91,tabDisplayQuestion,2,0)),FALSE)","v":false},null,{"$f":"IF(AND(W91=FALSE,E91<>\"\"),\"Error, remove value\",IF(AND(E91=\"\",W91=TRUE),\"Enter Value\",\"\"))","v":""},0]
[null,null,null,null,null,null,null,null,null,null,null,null,null,null,null,null,null,null,null,null,null,"",{"$f":"IF(U92<>\"\",F92,\"\")","v":""},null,null,0]
[null,{"$f":"IF(S93<>\"\",HLOOKUP(S93,tabQuestionCode,2,0),\"\")","v":"Was the member's previous scheme classic? "},null,null,null,null,null,null,{"$f":"IF(tabErrorMessage<>\"\",tabErrorMessage,\"\")","v":""},null,null,null,null,null,null,null,null,null,"2A",null,{"$f":"\"ui\"&S93","v":"ui2A"},0,{"$f":"IF(resRejoiner,IF(ISERROR(HLOOKUP(S93,tabDisplayQuestion,2,0)),FALSE,HLOOKUP(S93,tabDisplayQuestion,2,0)),FALSE)","v":false},null,{"$f":"IF(AND(W93=FALSE,E93<>\"\"),\"Error, remove value\",IF(AND(E93=\"\",W93=TRUE),\"Enter Value\",\"\"))","v":""},0]
[null,null,null,null,null,null,null,null,null,null,null,null,null,null,null,null,null,null,null,null,null,"",{"$f":"IF(U94<>\"\",F94,\"\")","v":""},null,null,0]
[null,{"$f":"IF(S95<>\"\",HLOOKUP(S95,tabQuestionCode,2,0),\"\")","v":"Was the member's previous scheme nuvos? "},null,null,null,null,null,null,{"$f":"IF(tabErrorMessage<>\"\",tabErrorMessage,\"\")","v":""},null,null,null,null,null,null,null,null,null,"2B",null,{"$f":"\"ui\"&S95","v":"ui2B"},0,{"$f":"IF(resRejoiner,IF(ISERROR(HLOOKUP(S95,tabDisplayQuestion,2,0)),FALSE,HLOOKUP(S95,tabDisplayQuestion,2,0)),FALSE)","v":false},null,"",0]
[null,null,null,null,null,null,null,null,null,null,null,null,null,null,null,null,null,null,null,null,null,"",{"$f":"IF(U96<>\"\",F96,\"\")","v":""},null,null,0]
[null,{"$f":"IF(S97<>\"\",HLOOKUP(S97,tabQuestionCode,2,0),\"\")","v":"Did the member receive a compensation payment? "},null,null,null,null,null,null,{"$f":"IF(tabErrorMessage<>\"\",tabErrorMessage,\"\")","v":""},null,null,null,null,null,null,null,null,null,3,null,{"$f":"\"ui\"&S97","v":"ui3"},0,{"$f":"IF(resRejoiner,IF(ISERROR(HLOOKUP(S97,tabDisplayQuestion,2,0)),FALSE,HLOOKUP(S97,tabDisplayQuestion,2,0)),FALSE)","v":false},null,{"$f":"IF(AND(W97=FALSE,E97<>\"\"),\"Error, remove value\",IF(AND(E97=\"\",W97=TRUE),\"Enter Value\",\"\"))","v":""},0]
[null,null,null,null,null,null,null,null,null,null,null,null,null,null,null,null,null,null,null,null,null,"",{"$f":"IF(U98<>\"\",F98,\"\")","v":""},null,null,0]
[null,{"$f":"IF(S99<>\"\",HLOOKUP(S99,tabQuestionCode,2,0),\"\")","v":"Did the member have pre-2010 CSCS terms? "},null,null,null,null,null,null,{"$f":"IF(tabErrorMessage<>\"\",tabErrorMessage,\"\")","v":""},null,null,null,null,null,null,null,null,null,3.5,null,{"$f":"\"ui\"&S99","v":"ui3.5"},0,{"$f":"IF(resRejoiner,IF(ISERROR(HLOOKUP(S99,tabDisplayQuestion,2,0)),FALSE,HLOOKUP(S99,tabDisplayQuestion,2,0)),FALSE)","v":false},null,{"$f":"IF(AND(W99=FALSE,E99<>\"\"),\"Error, remove value\",IF(AND(E99=\"\",W99=TRUE),\"Enter Value\",\"\"))","v":""},0]
[null,null,null,null,null,null,null,null,null,null,null,null,null,null,null,null,null,null,null,null,null,"",{"$f":"IF(U100<>\"\",F100,\"\")","v":""},null,null,0]
[null,{"$f":"IF(S101<>\"\",HLOOKUP(S101,tabQuestionCode,2,0),\"\")","v":"Does the member have a Civil Service pension in payment? "},null,null,null,null,null,null,{"$f":"IF(tabErrorMessage<>\"\",tabErrorMessage,\"\")","v":""},null,null,null,null,null,null,null,null,null,4,null,{"$f":"\"ui\"&S101","v":"ui4"},0,{"$f":"IF(resRejoiner,IF(ISERROR(HLOOKUP(S101,tabDisplayQuestion,2,0)),FALSE,HLOOKUP(S101,tabDisplayQuestion,2,0)),FALSE)","v":false},null,{"$f":"IF(AND(W101=FALSE,E101<>\"\"),\"Error, remove value\",IF(AND(E101=\"\",W101=TRUE),\"Enter Value\",\"\"))","v":""},0]
[null,null,null,null,null,null,null,null,null,null,null,null,null,null,null,null,null,null,null,null,null,"",{"$f":"IF(U102<>\"\",F102,\"\")","v":""},null,null,0]
[null,{"$f":"IF(S103<>\"\",HLOOKUP(S103,tabQuestionCode,2,0),\"\")","v":"Did the member re-join within 6 months? "},null,null,null,null,null,null,{"$f":"IF(tabErrorMessage<>\"\",tabErrorMessage,\"\")","v":""},null,null,null,null,null,null,null,null,null,"5A",null,{"$f":"\"ui\"&S103","v":"ui5A"},0,{"$f":"IF(resRejoiner,IF(ISERROR(HLOOKUP(S103,tabDisplayQuestion,2,0)),FALSE,HLOOKUP(S103,tabDisplayQuestion,2,0)),FALSE)","v":false},null,{"$f":"IF(AND(W103=FALSE,E103<>\"\"),\"Error, remove value\",IF(AND(E103=\"\",W103=TRUE),\"Enter Value\",\"\"))","v":""},0]
[null,null,null,null,null,null,null,null,null,null,null,null,null,null,null,null,null,null,null,null,null,"",{"$f":"IF(U104<>\"\",F104,\"\")","v":""},null,null,0]
[null,{"$f":"IF(S105<>\"\",HLOOKUP(S105,tabQuestionCode,2,0),\"\")","v":"Did the member re-join within 5 years? "},null,null,null,null,null,null,{"$f":"IF(tabErrorMessage<>\"\",tabErrorMessage,\"\")","v":""},null,null,null,null,null,null,null,null,null,"5B",null,{"$f":"\"ui\"&S105","v":"ui5B"},0,{"$f":"IF(resRejoiner,IF(ISERROR(HLOOKUP(S105,tabDisplayQuestion,2,0)),FALSE,HLOOKUP(S105,tabDisplayQuestion,2,0)),FALSE)","v":false},null,{"$f":"IF(AND(W105=FALSE,E105<>\"\"),\"Error, remove value\",IF(AND(E105=\"\",W105=TRUE),\"Enter Value\",\"\"))","v":""},0]
[null,null,null,null,null,null,null,null,null,null,null,null,null,null,null,null,null,null,null,null,null,"",{"$f":"IF(U106<>\"\",F106,\"\")","v":""},null,null,0]
[null,{"$f":"IF(S107<>\"\",HLOOKUP(S107,tabQuestionCode,2,0),\"\")","v":"Was the member's previous scheme partnership? "},null,null,null,null,null,null,{"$f":"IF(tabErrorMessage<>\"\",tabErrorMessage,\"\")","v":""},null,null,null,null,null,null,null,null,null,6,null,{"$f":"\"ui\"&S107","v":"ui6"},{"$f":"IF(S107<>\"\",E107,\"\")","v":0},{"$f":"IF(resRejoiner,IF(ISERROR(HLOOKUP(S107,tabDisplayQuestion,2,0)),FALSE,HLOOKUP(S107,tabDisplayQuestion,2,0)),FALSE)","v":false},null,{"$f":"IF(AND(W107=FALSE,E107<>\"\"),\"Error, remove value\",IF(AND(E107=\"\",W107=TRUE),\"Enter Value\",\"\"))","v":""},{"$f":"IF(Y107<>\"\",1,0)","v":0}]
[]
[null,{"$f":"IF(S109<>\"\",HLOOKUP(S109,tabQuestionCode,2,0),\"\")","v":"Did the member retire on a lower tier ill health?"},null,null,null,null,null,null,{"$f":"IF(tabErrorMessage<>\"\",tabErrorMessage,\"\")","v":""},null,null,null,null,null,null,null,null,null,7,null,{"$f":"\"ui\"&S109","v":"ui7"},{"$f":"IF(S109<>\"\",E109,\"\")","v":0},{"$f":"IF(resRejoiner,IF(ISERROR(HLOOKUP(S109,tabDisplayQuestion,2,0)),FALSE,HLOOKUP(S109,tabDisplayQuestion,2,0)),FALSE)","v":false},null,{"$f":"IF(AND(W109=FALSE,E109<>\"\"),\"Error, remove value\",IF(AND(E109=\"\",W109=TRUE),\"Enter Value\",\"\"))","v":""},{"$f":"IF(Y109<>\"\",1,0)","v":0}]
[null,null,null,null,null,null,null,null,null,null,null,null,null,null,null,null,null,null,null,null,null,"",null,null,null,0]
[null,null,null,null,null,null,null,null,null,null,null,null,null,null,null,null,null,null,null,null,null,{"$f":"IF(S111<>\"\",E111,\"\")","v":""},null,null,null,0]
[null,"Results",null,null,null,null,null,null,null,null,null,null,null,null,null,null,null,null,null,null,null,"",null,null,null,0]
[null,"Based on the above results the following actions should be taken : ",null,null,null,null,null,null,null,null,null,null,null,null,null,null,null,null,null,null,null,"",true,null,null,0]
[null,null,null,null,null,null,null,null,null,null,null,null,null,null,null,null,null,null,null,null,null,null,null,null,null,0]
[null,null,null,null,null,null,null,null,null,null,null,null,null,null,null,null,null,null,null,null,null,"",null,null,null,0]
[null,"The member can join (or re-join) one of the following schemes: ",null,null,{"$f":"resSchemes","v":"Check inputs"},null,null,null,null,null,null,null,null,null,null,null,null,null,null,null,"resSchemes","",null,null,null,0]
[null,null,null,null,null,null,null,null,null,null,null,null,null,null,null,null,null,null,null,null,null,"",null,null,null,0]
[null,"The member should be sent pack: ",null,null,{"$f":"resPack","v":""},null,null,null,null,null,null,null,null,null,null,null,null,null,null,null,"resPack","",null,null,null,0]
[null,null,null,null,null,null,null,null,null,null,null,null,null,null,null,null,null,null,null,null,null,"",null,null,null,0]
[null,"The following paragraph should be used in the pack: ",null,null,{"$f":"resParagraph","v":""},null,null,null,null,null,null,null,null,null,null,null,null,null,null,null,"resParagraph","",null,null,null,0]
[null,null,null,null,null,null,null,null,null,null,null,null,null,null,null,null,null,null,null,null,null,"",null,null,null,0]
[null,"Does abatement apply (CSP13)? ",null,null,{"$f":"resCSP13","v":""},null,null,null,null,null,null,null,null,null,null,null,null,null,null,null,"resCSP13","",null,null,null,0]
[null,null,null,null,null,null,null,null,null,null,null,null,null,null,null,null,null,null,null,null,null,"",null,null,null,0]
[null,"Should addition wording be included about compensation? ",null,null,{"$f":"resComp","v":""},null,null,null,null,null,null,null,null,null,null,null,null,null,null,null,"resComp","",null,null,null,0]
[null,null,null,null,null,null,null,null,null,null,null,null,null,null,null,null,null,null,null,null,null,"",null,null,null,0]
[null,"Should addition wording be included about quarantine? ",null,null,{"$f":"resQuar","v":""},null,null,null,null,null,null,null,null,null,null,null,null,null,null,null,"resQuar",null,null,null,null,0]
[null,null,null,null,null,null,null,null,null,null,null,null,null,null,null,null,null,null,null,null,null,null,null,null,null,0]
[null,"Should the original award be cancelled? ",null,null,{"$f":"resAwardCancel","v":""},null,null,null,null,null,null,null,null,null,null,null,null,null,null,null,"resAwardCancel",null,null,null,null,0]
[null,null,null,null,null,null,null,null,null,null,null,null,null,null,null,null,null,null,null,null,null,null,null,null,null,0]
[null,"Use declaration message: ",null,null,{"$f":"resDeclarationMessage","v":""},null,null,null,null,null,null,null,null,null,null,null,null,null,null,null,"resDeclarationMessage",null,null,null,null,0]
[null,null,null,null,null,null,null,null,null,null,null,null,null,null,null,null,null,null,null,null,null,null,null,null,null,0]
[null,"Interface message:",null,null,{"$f":"resInterfaceMessage","v":""},null,null,null,null,null,null,null,null,null,null,null,null,null,null,null,"resInterfaceMessage",null,null,null,null,0]
[null,null,null,null,null,null,null,null,null,null,null,null,null,null,null,null,null,null,null,null,null,null,null,null,null,0]
[null,"Public Service message:",null,null,{"$f":"resPublicServiceMessage","v":""},null,null,null,null,null,null,null,null,null,null,null,null,null,null,null,"resInterfaceMessage",null,null,null,null,0]
[null,null,null,null,null,null,null,null,null,null,null,null,null,null,null,null,null,null,null,null,null,null,null,null,null,0]
[null,null,null,null,null,null,null,null,null,null,null,null,null,null,null,null,null,null,null,null,null,null,null,null,null,0]
[null,null,null,"[ADMIN] Path Number",{"$f":"resID","v":"Check inputs"},null,null,null,null,null,null,null,null,null,null,null,null,null,null,null,"resInterfaceMessage",null,null,null,null,0]
[null,null,null,"[ADMIN] The path ID is: ",{"$f":"resUnID","v":"256Y12304N"},null,null,null,null,null,null,null,null,null,null,null,null,null,null,null,"resID",{"$f":"IF(S138<>\"\",E138,\"\")","v":""},null,null,null,{"$f":"IF(Y138<>\"\",1,0)","v":0}]
[]
[null,"Error Messages"]
[]
[null,{"$f":"IF(bInputsError,errInputsError,\"\")","v":"Check Error Messages (Red Text)"},{"$f":"IF(bInputsError,errInputsError,\"\")","v":"Check Error Messages (Red Text)"},{"$f":"IF(bInputsError,errInputsError,\"\")","v":"Check Error Messages (Red Text)"}]
[null,{"$f":"IF(bSPAErrors,errSPA,\"\")","v":"Check Sex or DOB"},{"$f":"IF(bSPAErrors,errSPA,\"\")","v":"Check Sex or DOB"},{"$f":"IF(bSPAErrors,errSPA,\"\")","v":"Check Sex or DOB"}]
[null,{"$f":"IF(bExpiryError,_errVersion,\"\")","v":""},{"$f":"IF(bExpiryError,_errVersion,\"\")","v":""},{"$f":"IF(bExpiryError,_errVersion,\"\")","v":""}]
[null,{"$f":"IF(bVersionError,_errVersion,\"\")","v":""},{"$f":"IF(bVersionError,_errVersion,\"\")","v":""},{"$f":"IF(bVersionError,_errVersion,\"\")","v":""}]
[null,{"$f":"IF(bServiceTableError,errServiceTableError,\"\")","v":"Check Service Table"},{"$f":"IF(bVersionError,_errVersion,\"\")","v":""},{"$f":"IF(bVersionError,_errVersion,\"\")","v":""}]
[]
[]
[]
[null,null,null,null,null,null,null,null,null,null,null,null,null,null,8]
[null,null,null,null,null,null,null,null,null,null,null,null,null,null,9]
[null,null,null,null,null,null,null,null,null,null,null,null,null,null,10]
[null,null,null,null,null,null,null,null,null,null,null,null,null,null,11]
[null,null,null,null,null,null,null,null,null,null,null,null,null,null,12]
[null,"Audit",null,null,null,null,null,null,null,null,null,null,null,null,15]
[null,{"$f":"msgPrint","v":"08:08,  16 Jun 2022 .  "},null,null,null,null,null,null,null,null,null,null,null,null,16]
[null,{"$f":"msgFileName","v":"Filename : C:\\Users\\roweg\\AppData\\Local\\Microsoft\\Windows\\INetCache\\Content.Outlook\\Q0ID2JYB\\[joiner-tool_april-2022.xlsm"},null,null,null,null,null,null,null,null,null,null,null,null,17]
[null,{"$f":"msgVersionNumber","v":"Version number : 104.  "},null,null,null,null,null,null,null,null,null,null,null,null,18]
[null,{"$f":"msgExpiration","v":"Tool expires on 01/04/2023.  "},null,null,null,null,null,null,null,null,null,null,null,null,19]
[null,{"$f":"msgPDFSaveLocation","v":"PDF saved to : TBC"},null,null,null,null,null,null,null,null,null,null,null,null,20]
[null,"END OF FORM",null,null,null,null,null,null,null,null,null,null,null,null,21]
[null,null,null,null,null,null,null,null,null,null,null,null,null,null,22]

{"sheet":"Joiner Calculations_hide","index":2,"n_rows":613,"n_cols":49,"rows_kept":613,"cut":false,"hidden":true,"merged":[[3,2,3,6],[4,2,4,6],[56,2,56,6],[10,2,10,6],[97,16,97,26],[30,2,30,6],[38,2,38,6],[39,2,39,6]]}
[null,null,{"$f":"strToolName","v":"Joiner Tool"}]
[]
[]
[null,"Description","This sheet is intended to be used by ADMINISTRATION staff as a backend tool.  It is not expected that this will be exposed to the public users.  This tool was developed quickly and include a lot of redundant code that was left in so as not to break existing functionality and so speed up the development process.  This should be backed out at some point in the future."]
[null,"Schemes","All"]
[]
[]
[null,null,{"$f":"strToolName&\" - Inputs Calculations\"","v":"Joiner Tool - Inputs Calculations"}]
[]
[]
[null,"Description","The joiner tool provides the logic to determine if a member if a JOINER or REJOINER.  This logic includes all  the  2015 PS/CS history, rejoiner rationale, Taper dates etc."]
[]
[null,"Stage 1 - Personal Details"]
[null,"Name",{"$f":"uiName","v":0},"Name",null,"Key to cell colours:"]
[null,"National Insurance Number",{"$f":"uiNINO","v":0},"NINO",null,"User inputs from input sheet (yellow)"]
[null,"Your date of birth",{"$f":"uiDOB","v":"00:00:00"},"DOB",null,"Work Variable (orange)"]
[null,"When are you starting work?",{"$f":"uiStartDate","v":"00:00:00"},"StartDate",null,"Output (green)"]
[null,"Sex?",{"$f":"uiSex","v":0},"Sex",null,"Messages (pink)"]
[]
[null,"Stage 2 - Joining Status - About your Public and Civil Pensionable Service History",null,null,null,"System Variable (dark green)"]
[null,"Have you ever been a member of the Civil Service pension arrangements?",{"$f":"IF(uiPrevMemCS=\"\",\"\",uiPrevMemCS)","v":""},"PrevMemCS",null,"Error In Cell (red)"]
[null,"Previous Public Service Pension Scheme?",{"$f":"IF(uiPrevMemPS=\"\",\"\",uiPrevMemPS)","v":""},"PrevMemPS"]
[null,"Was you Civil Service Scheme 'By Analogy'?",{"$f":"uiByAnalogy","v":0},"ByAnalogy"]
[null,{"$f":"IF(uiByAnalogy=\"Y\",\"What was the by-anaology equivalent scheme?\",\"What Civil Service Scheme Were you in?\")","v":"What Civil Service Scheme Were you in?"},{"$f":"uiCSScheme","v":0},"CSScheme"]
[]
[]
[]
[null,null,{"$f":"strToolName&\" - NPA and SPA Calculations\"","v":"Joiner Tool - NPA and SPA Calculations"}]
[]
[]
[null,"Description","This section is used to calculate the State Pension Age and Date, it uses a self-contained sheet - SPDCalcualtions_Hide"]
[]
[null,"State Pension Age",{"$f":"IF(AND(OR(DOB=0,Sex=0),LEFT(resstrSPA,3)=\"SPA\"),\"\",resstrSPA)","v":""},"ressSPA"]
[]
[null,"Previous Scheme NPA if CS or By Analogy ",{"$f":"IF(AND(PrevMemCS=\"Y\",NOT(ISERROR(VLOOKUP(CSScheme,tabNPA,2,0)))),\nVLOOKUP(CSScheme,tabNPA,2,0),\"\")","v":""},"resPrevSchemeNPACS"]
[null,"Public Service Decalaraiortn",{"$f":"uiPSConfirmation","v":0},"resPSConfirmation","Member’s Public Pensionable Service may not be eligible, refer case to MyCSP.","msgPSConfirmation"]
[]
[null,null,{"$f":"strToolName&\" - Establish if rejoiner?\"","v":"Joiner Tool - Establish if rejoiner?"}]
[null,"Description","This section is used to establish if a member should re-join the PCSPS or alpha schemes, the outcomes are 'PCSPS Rejoiner', 'alpha Rejoiner' or 'Gets A Pack'"]
[null,null,"This is an interim calculation stage and is used for path references 93-99, which then feed in to the PCSPC or alpha rejoiner routines."]
[]
[null,"Rejoiner options",null,null,null,"Question ID"]
[null,"Previously Alpha?",{"$f":"IF(PrevMemCS=\"Y\",IF(CSScheme=\"alpha\",\"Y\",\"N\"),\"N\")","v":"N"},"resPrevSchemeAlpha",null,"B"]
[null,"Tapered enrolment",{"$f":"X104","v":"Y"},"resTaperedEnrolment",null,"E"]
[null,"Start Date < 1/4/2015",{"$f":"IF( uiStartDate<day2015_,\"Y\",\"N\")","v":"Y"},"resSDateLTDayOne",null,"G"]
[null,"Start Date < Taper Date",{"$f":"IF(AND(res2012PresenceCheck=\"Y\",resPrevSchemeAlpha=\"N\",resLT13p5=\"Y\",resLT10=\"N\"),\nIF(OR(uiStartDate<resTEDate),\"Y\",\"N\"),\"\")","v":""},"resSDateLTETEDate",null,"G"]
[null,"Alpha rejoiner?  Used in alpha rejoiner routines",{"$f":" IF(OR(AND(PrevMemCS=\"Y\",resPrevSchemeAlpha=\"Y\"),\n                 AND(PrevMemCS=\"Y\",resPrevSchemeAlpha=\"N\",res2012PresenceCheck=\"Y\",\n                             OR(\n                                     AND(resLT13p5=\"Y\",resLT10=\"Y\",resFullyProtected=\"N\"),\n                                     AND(resLT13p5=\"Y\",resLT10=\"N\",resTaperedEnrolment=\"Y\",resSDateLTETEDate=\"N\"),\n\n                                    AND(resLT13p5=\"N\"),\n                                   AND(resLT13p5=\"Y\",resLT10=\"N\",resTaperedEnrolment=\"N\",resSDateLTETEDate=\"N\"),\n                                   AND(resLT13p5=\"Y\",resLT10=\"N\",resTaperedEnrolment=\"N\",resSDateLTETEDate=\"Y\")\n                                   )\n                            )\n                 ),\"Y\",\"N\")","v":"N"},"resAlphaReJoiner","Path References : 93,95,97,98,99,110","0A"]
[null,"PCSPS rejoiner? Used in PCSPS rejoiner routines",{"$f":" IF(OR(AND(PrevMemCS=\"Y\",resPrevSchemeAlpha=\"N\",res2012PresenceCheck=\"Y\",resLT13p5=\"Y\",resLT10=\"Y\",resFullyProtected=\"Y\"),\n                 AND(PrevMemCS=\"Y\",resPrevSchemeAlpha=\"N\",res2012PresenceCheck=\"Y\",resLT13p5=\"Y\",resLT10=\"N\",resTaperedEnrolment=\"Y\",resSDateLTETEDate=\"Y\"),\n                AND(PrevMemCS=\"Y\",resPrevSchemeAlpha=\"N\",res2012PresenceCheck=\"Y\",resLT13p5=\"Y\",resLT10=\"N\",resTaperedEnrolment=\"N\",resSDateLTETEDate=\"Y\"),\n                 ),\"Y\",\"N\")","v":"N"},"resPCSPCReJoiner","Path References : 94,96,111","0B"]
[null,"Alpha rejoiner?  Used in alpha rejoiner routines PATH REF",{"$f":" IF(OR(AND(PrevMemCS=\"Y\",resPrevSchemeAlpha=\"Y\"),\n                 AND(PrevMemCS=\"Y\",resPrevSchemeAlpha=\"N\",res2012PresenceCheck=\"Y\",\n                             OR(\n                                     AND(resLT13p5=\"Y\",resLT10=\"Y\",resFullyProtected=\"N\"),\n                                     AND(resLT13p5=\"Y\",resLT10=\"N\",resTaperedEnrolment=\"Y\",resSDateLTETEDate=\"N\"),\n                                     AND(resLT13p5=\"Y\",resLT10=\"N\",resTaperedEnrolment=\"N\",resSDateLTETEDate=\"Y\"),\n                                    AND(resLT13p5=\"N\"),\n                                   AND(resLT13p5=\"Y\",resLT10=\"N\",resTaperedEnrolment=\"N\",resSDateLTETEDate=\"N\")\n                                   )\n                            )\n                 ),\"Y\",\"N\")","v":"N"}]
[null,"PCSPS rejoiner? Used in PCSPS rejoiner routines PATH REF",{"$f":" IF(OR(AND(PrevMemCS=\"Y\",resPrevSchemeAlpha=\"N\",res2012PresenceCheck=\"Y\",resLT13p5=\"Y\",resLT10=\"Y\",resFullyProtected=\"Y\"),\n                 AND(PrevMemCS=\"Y\",resPrevSchemeAlpha=\"N\",res2012PresenceCheck=\"Y\",resLT13p5=\"Y\",resLT10=\"N\",resTaperedEnrolment=\"Y\",resSDateLTETEDate=\"Y\"),\n                 ),\"Y\",\"N\")","v":"N"}]
[]
[null,"Status ",{"$f":"IF(resAlphaReJoiner=\"Y\",\"Alpha Rejoiner\",\"\")&\n          IF(resPCSPCReJoiner=\"Y\",\"PCSPS Rejoiner\",\"\")&\n                   IF(AND(resPCSPCReJoiner=\"N\",resAlphaReJoiner=\"N\",resTaperedEnrolment=\"N\"),\"New Joiner\",\"\")","v":""},"RejoinerStatus"]
[null,"is member rejoiner ?",{"$f":"IF(RejoinerStatus=\"Alpha Rejoiner\",TRUE,IF(RejoinerStatus=\"PCSPS Rejoiner\",TRUE,\"false\"))","v":"false"},"resRejoiner"]
[null,"Rejoiner Status Message ",{"$f":"IF(ISERROR(RejoinerStatus),\"\",\nIF(RejoinerStatus=\"Alpha Rejoiner\",\"You have been identified as a rejoiner (alpha route), continue questions in section 4\",\"\")&\nIF(RejoinerStatus=\"PCSPS Rejoiner\",\"You have been identified as a rejoiner (alpha route), continue questions in section 4.\",\"\")&\nIF(RejoinerStatus=\"New Joiner\",\"New Joiner, see section below for pack details in section 5\",\"\"))&\nIF(RejoinerStatus=\"Taper Joiner\",\"New Joiner, see section below for pack details in section 5\",\"\")","v":""},"resRejoinerStatusMessage"]
[]
[null,null,{"$f":"strToolName&\" - Pension Service History Status and Taper Calculations\"","v":"Joiner Tool - Pension Service History Status and Taper Calculations"}]
[null,"Description","This section is used to calculate the Presence status at 2012, 2015 and if member was on a qualifying break."]
[null,null,"This sheet uses logic in the sheet PresenceCheck_Calculations_hide"]
[]
[null,"Present 2012?",{"$f":"IF(bServiceTableError,\"\",IF(OR(PrevMemCS=\"Y\",PrevMemPS=\"Y\"),\n         IF(bEligBreak,\"Y\",\"N\"),\n\"\"))","v":""},"res2012PresenceCheck",null,"B2"]
[null,"NPA in Scheme at 2012",{"$f":"IF(res2012PresenceCheck=\"Y\",iNPAFromSourceScheme,\"\")","v":""},"resNPAFromSourceScheme",null,"Question ID"]
[]
[null,"<13.5 Yrs to NPA?",{"$f":"IF(res2012PresenceCheck=\"Y\",\nIF(OR(PresenceCheck_Calculations!bTapered=TRUE,PresenceCheck_Calculations!bFullyProtected=TRUE),\"Y\",\"N\"),\"\")","v":""},"resLT13p5","AAA","C"]
[null,"<10 Yrs to NPA?",{"$f":"IF(resLT13p5=\"Y\",\n   IF(NOT(ISERROR(PresenceCheck_Calculations!bFullyProtected)),\n   IF(PresenceCheck_Calculations!bFullyProtected,\"Y\",\"N\"),\"N\"),\"\")","v":""},"resLT10",null,"D"]
[null,"Fully Protected?",{"$f":"resLT10","v":""},"resFullyProtected",null,"F"]
[]
[null,"Taper Date ",{"$f":"IF(X104=\"N\",DATE(2015,4,1),DATE(YEAR(TEDateNPA),MONTH(TEDateNPA),DAY(TEDateNPA)))","v":"2015-04-01"},"resTEDate"]
[null,"Taper Date Message",{"$f":"IF(ISERROR(resTEDate),\"\",\nIF(resFullyProtected=\"Y\",\"\",\nIF(res2012PresenceCheck=\"Y\",\"The member's taper date is \"&TEXT(resTEDate,\"dd/mm/yyyy\"),\"\")))","v":""},"resTEDateMessage"]
[null,"MsgTaper",{"$f":"IF(resFullyProtected=\"Y\",\"The member is Fully Protected and will not go in to alpha\",\n         IF(ISERROR(resTEDate>StartDate),\"\",\n                    IF(AND(resTEDate=\"1/4/2015\",resTEDate>StartDate),\"The member will move in to alpha on 1/4/2015.\",\n                    IF(AND(resTEDate>StartDate),\"The member will join alpha on their taper date of  \"&TEXT(resTEDate,\"dd/mm/yyyy\")&\".\",\n                    IF(AND(resTEDate=\"1/4/2015\",resTEDate<=StartDate),\"The member's date of joining \"&TEXT(StartDate,\"dd/mm/yyyy\")&\" is after 1/4/2015  therefore the member has no protection.\",\n                    IF(AND(resTEDate<=StartDate),\"The member's date of joining \"&TEXT(StartDate,\"dd/mm/yyyy\")&\" is on or after their taper date of  \"&TEXT(resTEDate,\"dd/mm/yyyy\")&\".\"))))\n))","v":"The member will join alpha on their taper date of  01/04/2015."},"msgTaper"]
[null,"Message of eligible employement",{"$f":"IF(OR(strStatus2012=\"\",strStatus2015=\"\"),\"No service history at either 31/3/2012 or 31/3/2015 therefore the member will not have any right to rejoin an existing scheme.  Member joins alpha.\",\"\")","v":"No service history at either 31/3/2012 or 31/3/2015 therefore the member will not have any right to rejoin an existing scheme.  Member joins alpha."},"msgEligEmployment",null,{"$f":"IF(resPSConfirmation=\"N\",msgPSConfirmation,IF(0>0,errCheckInputs,IF(bfound,VLOOKUP(\"134238208Y8192N\",tabRes,E79,0),errNotFound)))","v":"Not Found : Carry on or check error messages"}]
[null,"Assumed NPA at 2012 message",{"$f":"\"Assumed Normal Pension Age based on service at 31/03/2012 is \"&iNPAFromSourceScheme","v":"Assumed Normal Pension Age based on service at 31/03/2012 is "},"msgAssumedNPA2012"]
[null,"Eligibility Statement : ",{"$f":"IF(bEligBreak,\"Based on the member's break history the member is eligible to be considered for protection or tapering, carry on below.  \",\"Member was not on a qualifying break at either 2012 or 2015 and is not eligible for any protection.  \")","v":"Member was not on a qualifying break at either 2012 or 2015 and is not eligible for any protection.  "},"msgEligBreak2"]
[]
[null,null,{"$f":"strToolName&\" - Results\"","v":"Joiner Tool - Results"},null,null,null,{"$f":"IF(ISERROR(resTEDate),\"\",\"The member's taper date is : \"&TEXT(resTEDate,\"dd/mm/yyyy\"))","v":"The member's taper date is : 01/04/2015"}]
[]
[null,"Path found?",{"$f":"IF(resPSConfirmation=\"N\",TRUE,IF(ISERROR(VLOOKUP(UnID,P111:P233,1,0)),FALSE,TRUE))","v":false},"bfound"]
[null,"Unique Path ID",{"$f":"UnID","v":"256Y12304N"},"resUnID"]
[null,null,null,null,"Column Lookup"]
[null,"Result ID",{"$f":"IF(resPSConfirmation=\"N\",msgPSConfirmation,IF(uiErrorCount>0,errCheckInputs,IF(bfound,VLOOKUP(UnID,tabRes,E79,0),errNotFound)))","v":"Check inputs"},"resID",2]
[null,"Schemes",{"$f":"IF(resPSConfirmation=\"N\",msgPSConfirmation,IF(uiErrorCount>0,errCheckInputs,IF(bfound,VLOOKUP(UnID,tabRes,E80,0),errNotFound)))","v":"Check inputs"},"resSchemes",3]
[null,"Pack",{"$f":"IF(uiErrorCount>0,\"\",\nIF(OR(ISERROR(VLOOKUP(UnID,tabRes,E81,0)),ISBLANK(VLOOKUP(UnID,tabRes,E81,0))),\"\",IF(bfound,VLOOKUP(UnID,tabRes,E81,0),\"\")))","v":""},"resPack",4]
[null,"Paragraph","","resParagraph",5]
[null,"CSP13?","","resCSP13",6]
[null,"Compensation?","","resComp",7]
[null,"Quarantine?","","resQuar",8]
[null,"Award  Cancelled?","","resAwardCancel",9]
[null,"Declaration Message","","resDeclarationMessage",10]
[null,"Interface Message","","resInterfaceMessage",11]
[null,"Path Number",{"$f":"IF(uiErrorCount>0,\"\",IF(resPSConfirmation=\"N\",\"1000\",\nIF(OR(ISERROR(VLOOKUP(UnID,tabRes,E88,0))),\"\",IF(bfound,VLOOKUP(UnID,tabRes,E89,0),\"\"))))","v":""},"resPathNumber",2]
[null,null," "]
[null,"Public Service Message",{"$f":"IF(resPSConfirmation=\"N\",\"\",IF(PrevMemPS=\"Y\",\"Complete the Public Service History form\",\"\"))","v":""},"resPublicServiceMessage"]
[]
[]
[null,null,{"$f":"strToolName&\" - REJOINER Calculations\"","v":"Joiner Tool - REJOINER Calculations"}]
[]
[]
[null,null,null,null,null,null,null,null,null,null,null,null,"Assumes order of questions is fixed"]
[null,null,null,null,null,null,null,null,null,null,null,null,null,null,null,null,"Determine rejoiner Status"]
[null,null,null,null,null,null,null,null,null,null,null,null,"Q number","Responses",null,"tabQNum",1,2,3,4,5,6,7,8,9,10,11,12,13,14,15,16,17,18,19,20,21,22,23,24,25,26,27,28,29,30,31,32,33]
[null,null,null,null,null,null,null,null,null,null,null,null,"Business Logic, Decision drive by questions",null,null,"tabQUID",0,{"$f":"2^(tabQNum)","v":4},8,16,32,64,128,256,512,1024,2048,4096,8192,16384,32768,65536,131072,262144,524288,1048576,2097152,4194304,8388608,16777216,33554432,67108864,134217728,268435456,536870912,1073741824,2147483648,4294967296,8589934592]
[]
[null,null,null,null,null,null,null,null,null,null,null,null,"Level, aligns with logic chart in Visio",null,null,null,"A","A0","A1","B","B2","C","D","E","F","G","H","0A","0B","1A","1B","1C","1D","1E","1F","1G","1H",1.5,"2A","2B",3,3.5,4,"5A","5B",6,7]
[null,null,null,null,null,null,null,null,null,null,null,null,"Q","Sum of 'Yes'","Sum of 'No'","UniqueID","Display","Has the member ever been a member of the Civil Service Pension arrangements?","Has the member ever been a member of the public service pension arrangements?","Was the member previously in the alpha scheme?","Was the member in either public or civil service on 1/4/2012?","Was the member MORE THAN 13.5 years to the public or civil pension service NPA @ 1/4/2012","Was the member LESS THAN 10 years to the public or civil pension service NPA @ 1/4/2012","As the member was in Civil Service at 31/3/2012 they should have taken part in the Options Exercise.  Did the member opt to move on their Taper Date (Y)?","Is the member fully protected?","Is the member's start date less than their Taper Date?",null,"Alpha rejoiner?","PCSPS rejoiner?","Did the member resign from their previous service?","Was the member dismissed due to inefficiency, end of fixed term contract or did their Fixed Term Appointment (FTA) end?","Did the take an approved early retirement (AER)?","Did the member take an age retirement? ","Did the member take an ill-health retirement? ","Did the member take an early retirement (ARR)? ","Did the member leave WITH early leaver reserved rights? ","Did the member leave WITHOUT early leaver reserved rights? ","Did the member have more than two years' qualifying service? ","Was the member's previous scheme classic? ","Was the member's previous scheme nuvos? ","Did the member receive a compensation payment? ","Did the member have pre-2010 CSCS terms? ","Does the member have a Civil Service pension in payment? ","Did the member re-join within 6 months? ","Did the member re-join within 5 years? ","Was the member's previous scheme partnership? ","Did the member retire on a lower tier ill health?"]
[null,null,null,null,null,null,null,null,null,null,null,null," Responses",{"$f":"IF(AND(AB104=\"N\",AC104=\"N\"),SUMIF(Q104:AC104,\"Y\",$Q$100:$AC$100),SUMIF(AB104:AW104,\"Y\",$AB$100:$AW$100))","v":256},{"$f":"IF(AND(AB104=\"N\",AC104=\"N\"),SUMIF(Q104:AC104,\"N\",$Q$100:$AC$100),SUMIF(AB104:AW104,\"N\",$AB$100:$AW$100))","v":12304},{"$f":"N104&\"Y\"&O104&\"N\"","v":"256Y12304N"},"Y",{"$f":"IF(ISERROR(VLOOKUP(R102,uitabResults,4,0)),0,VLOOKUP(R102,uitabResults,4,0))","v":0},{"$f":"IF(R104=\"Y\",\"\",IF(ISERROR(VLOOKUP(S102,uitabResults,4,0)),0,VLOOKUP(S102,uitabResults,4,0)))","v":0},{"$f":"resPrevSchemeAlpha","v":"N"},{"$f":"res2012PresenceCheck","v":""},{"$f":"resLT13p5","v":""},{"$f":"resLT10","v":""},{"$f":"IF(ISERROR(VLOOKUP(X102,uitabResults,4,0)),0,VLOOKUP(X102,uitabResults,4,0))","v":"Y"},{"$f":"resFullyProtected","v":""},{"$f":"resSDateLTETEDate","v":""},null,{"$f":"IF(ISERROR(VLOOKUP(AB102,uitabResults,4,0)),0,VLOOKUP(AB102,uitabResults,4,0))","v":"N"},{"$f":"IF(ISERROR(VLOOKUP(AC102,uitabResults,4,0)),0,VLOOKUP(AC102,uitabResults,4,0))","v":"N"},0,0,0,0,0,0,0,0,0,0,0,0,0,0,0,0,0,0,0,0]
[null,null,null,null,null,null,null,null,null,null,null,null,"Cumulative sum of QUID",null,null,null,{"$f":"SUM(Q106:Q107)","v":0},{"$f":"SUM(R106:R107)","v":0},{"$f":"SUM(S106:S107)","v":0},0,{"$f":"SUM(U106:U107)","v":0},{"$f":"SUM(V106:V107)","v":0},{"$f":"SUM(W106:W107)","v":0},{"$f":"SUM(X106:X107)","v":0},0,0,0,{"$f":"IF(AND($AB$104=\"N\",$AC$104=\"N\"),0,SUM(AB106:AB107))","v":0},{"$f":"IF(AND($AB$104=\"N\",$AC$104=\"N\"),0,SUM(AC106:AC107))","v":0},0,0,0,0,0,0,0,0,0,0,0,0,0,0,0,0,0,0,0,0]
[null,null,null,null,null,null,null,null,null,null,null,null,"Cumulative sum of QUID YES",null,null,null,{"$f":"IF(AND(AB104=\"N\",AC104=\"N\"),IF(Q104=\"Y\",tabQUID,0),0)","v":0},0,0,0,0,0,0,0,0,0,0,{"$f":"IF(AND($AB$104=\"N\",$AC$104=\"N\"),0,IF(AB104=\"Y\",tabQUID,0)+AA106)","v":0},0,0,0,0,0,0,0,0,0,0,0,0,0,0,0,0,0,0,0,0,0]
[null,null,null,null,null,null,null,null,null,null,null,null,"Cumulative sum of QUID NO",null,null,null,{"$f":"IF(AND(AB104=\"N\",AC104=\"N\"),IF(Q104=\"N\",tabQUID,0),0)","v":0},0,0,0,0,0,0,0,0,0,0,{"$f":"IF(AND($AB$104=\"N\",$AC$104=\"N\"),0,IF(AB104=\"N\",tabQUID,0)+AA107)","v":0},0,0,0,0,0,0,0,0,0,0,0,0,0,0,0,0,0,0,0,0,0]
["Error"]
[{"$f":"IF(SUM(A111:A233)>0,errUniqueness,\"\")","v":"Not all paths are unique"},null,null,null,null,null,null,null,null,null,null,null,"Business Logic"]
["Uniqueness Check","Unique ID","Path Reference","Schemes Available","Pack","Paragraph","CSP 13-abatement","Compensation","Quarantine","Award Cancelled","Declaration message","Interface Message","Outcome","Sum of 'Yes'","Sum of 'No'","UniqueID",{"$f":"Q103","v":"Display"},"Has the member ever been a member of the Civil Service Pension arrangements?","Has the member ever been a member of the public service pension arrangements?","Was the member previously in the alpha scheme?","Was the member in either public or civil service on 1/4/2012?","Was the member MORE THAN 13.5 years to the public or civil pension service NPA @ 1/4/2012","Was the member LESS THAN 10 years to the public or civil pension service NPA @ 1/4/2012","As the member was in Civil Service at 31/3/2012 they should have taken part in the Options Exercise.  Did the member opt to move on their Taper Date (Y)?","Is the member fully protected?","Is the member's start date less than their Taper Date?",0,"Alpha rejoiner?","PCSPS rejoiner?","Did the member resign from their previous service?","Was the member dismissed due to inefficiency, end of fixed term contract or did their Fixed Term Appointment (FTA) end?","Did the take an approved early retirement (AER)?","Did the member take an age retirement? ","Did the member take an ill-health retirement? ","Did the member take an early retirement (ARR)? ","Did the member leave WITH early leaver reserved rights? ","Did the member leave WITHOUT early leaver reserved rights? ","Did the member have more than two years' qualifying service? ","Was the member's previous scheme classic? ","Was the member's previous scheme nuvos? ","Did the member receive a compensation payment? ","Did the member have pre-2010 CSCS terms? ","Does the member have a Civil Service pension in payment? ","Did the member re-join within 6 months? ","Did the member re-join within 5 years? ","Was the member's previous scheme partnership? ","Did the member retire on a lower tier ill health?",0,{"$f":"AW103","v":0}]
[{"$f":"IF(B111=\"0Y0N\",0,COUNTIF($B$111:$B$233,B111)-1)","v":0},{"$f":"P111","v":"134242304Y4198400N"},1,"Scheme - alpha or partnership","alpha","alpha Paragraph E","Y",null,null,null,null,null,{"$f":"D111&\"_\"&E111&\"_\"&F111&\"_\"&G111&\"_\"&H111&\"_\"&I111&\"_\"","v":"Scheme - alpha or partnership_alpha_alpha Paragraph E_Y___"},{"$f":"SUMIF(Q111:AW111,\"Y\",$Q$100:$AH$100)","v":134242304},{"$f":"SUMIF(Q111:AW111,\"N\",$Q$100:$AH$100)","v":4198400},{"$f":"N111&\"Y\"&O111&\"N\"","v":"134242304Y4198400N"},"Y",null,null,null,null,null,null,null,null,null,null,"N","Y","Y",null,null,null,null,null,null,null,"N",null,null,null,null,"Y"]
[0,"24576Y138416128N",2,"Scheme - alpha or partnership","alpha","alpha Paragraph A"," ",null,null,null,null,null,"Scheme - alpha or partnership_alpha_alpha Paragraph A_ ___",24576,138416128,"24576Y138416128N","Y",null,null,null,null,null,null,null,null,null,null,"N","Y","Y",null,null,null,null,null,null,null,"N",null,null,null,null,"N"]
[0,"155213824Y4096N",3,"Scheme - alpha or partnership","alpha","alpha Paragraph E","Y",null,null,null,null,null,"Scheme - alpha or partnership_alpha_alpha Paragraph E_Y___",155213824,4096,"155213824Y4096N","Y",null,null,null,null,null,null,null,null,null,null,"N","Y","Y",null,null,null,null,null,null,null,"Y",null,"Y",null,null,"Y"]
[0,"20996096Y134221824N",4,"Scheme - alpha or partnership","alpha","alpha Paragraph A",null,null,null,null,null,null,"Scheme - alpha or partnership_alpha_alpha Paragraph A____",20996096,134221824,"20996096Y134221824N","Y",null,null,null,null,null,null,null,null,null,null,"N","Y","Y",null,null,null,null,null,null,null,"Y",null,"Y",null,null,"N"]
[0,"138436608Y16781312N",5,"Scheme - alpha or partnership","alpha","alpha Paragraph E","Y",null,null,null,null,null,"Scheme - alpha or partnership_alpha_alpha Paragraph E_Y___",138436608,16781312,"138436608Y16781312N","Y",null,null,null,null,null,null,null,null,null,null,"N","Y","Y",null,null,null,null,null,null,null,"Y",null,"N",null,null,"Y"]
[0,"1614831616Y150999040N",6,"Scheme - alpha or partnership","alpha","alpha Paragraph A",null,null,null,null,null,null,"Scheme - alpha or partnership_alpha_alpha Paragraph A____",1614831616,150999040,"1614831616Y150999040N","Y",null,null,null,null,null,null,null,null,null,null,"N","Y","Y",null,null,null,null,null,null,null,"Y",null,"N",null,null,"N",null,"Y","Y"]
[0,"541089792Y1224740864N",7,"Scheme - alpha or partnership","alpha","alpha Paragraph G",null,null,null,null,null,"This is a rejoiner, Mark as R on the interface","Scheme - alpha or partnership_alpha_alpha Paragraph G____",541089792,1224740864,"541089792Y1224740864N","Y",null,null,null,null,null,null,null,null,null,null,"N","Y","Y",null,null,null,null,null,null,null,"Y",null,"N",null,null,"N",null,"Y","N"]
[0,"4218880Y687869952N",8,"Scheme - alpha or partnership","alpha","alpha Paragraph A",null,null,null,null,null,null,"Scheme - alpha or partnership_alpha_alpha Paragraph A____",4218880,687869952,"4218880Y687869952N","Y",null,null,null,null,null,null,null,null,null,null,"N","Y","Y",null,null,null,null,null,null,null,"Y",null,"N",null,null,"N",null,"N"]
[0,"453025792Y4214784N",9,"Scheme - alpha or partnership","alpha","alpha Paragraph M","Y","Y - Check £100,000 compensation limit",null,null,"Complete Declaration",null,"Scheme - alpha or partnership_alpha_alpha Paragraph M_Y_Y - Check £100,000 compensation limit__",453025792,4214784,"453025792Y4214784N","Y",null,null,null,null,null,null,null,null,null,null,"N","Y","N","Y",null,null,null,null,null,null,"N",null,"Y","Y",null,"Y","Y"]
[0,"184590336Y272650240N",10,"Scheme - alpha or partnership","alpha","alpha Paragraph E","Y",null,null,null,null,null,"Scheme - alpha or partnership_alpha_alpha Paragraph E_Y___",184590336,272650240,"184590336Y272650240N","Y",null,null,null,null,null,null,null,null,null,null,"N","Y","N","Y",null,null,null,null,null,null,"N",null,"Y","Y",null,"Y","N"]
[0,"318808064Y138432512N",11,"Scheme - alpha or partnership","alpha","alpha Paragraph M",null,"Y - Check £100,000 compensation limit",null,null,"Complete Declaration",null,"Scheme - alpha or partnership_alpha_alpha Paragraph M__Y - Check £100,000 compensation limit__",318808064,138432512,"318808064Y138432512N","Y",null,null,null,null,null,null,null,null,null,null,"N","Y","N","Y",null,null,null,null,null,null,"N",null,"Y","Y",null,"N","Y"]
[0,"50372608Y406867968N",12,"Scheme - alpha or partnership","alpha","alpha Paragraph A",null,null,null,null,null,null,"Scheme - alpha or partnership_alpha_alpha Paragraph A____",50372608,406867968,"50372608Y406867968N","Y",null,null,null,null,null,null,null,null,null,null,"N","Y","N","Y",null,null,null,null,null,null,"N",null,"Y","Y",null,"N","N"]
[0,"151035904Y37769216N",13,"Scheme - alpha or partnership","alpha","alpha Paragraph E","Y",null,null,null,null,null,"Scheme - alpha or partnership_alpha_alpha Paragraph E_Y___",151035904,37769216,"151035904Y37769216N","Y",null,null,null,null,null,null,null,null,null,null,"N","Y","N","Y",null,null,null,null,null,null,"N",null,"Y","N",null,"Y"]
[0,"16818176Y171986944N",14,"Scheme - alpha or partnership","alpha","alpha Paragraph A",null,null,null,null,null,null,"Scheme - alpha or partnership_alpha_alpha Paragraph A____",16818176,171986944,"16818176Y171986944N","Y",null,null,null,null,null,null,null,null,null,null,"N","Y","N","Y",null,null,null,null,null,null,"N",null,"Y","N",null,"N"]
[0,"436248576Y20992000N",15,"Scheme - alpha or partnership","alpha","alpha Paragraph M","Y","Y - Check £100,000 compensation limit",null,"Y",null,null,"Scheme - alpha or partnership_alpha_alpha Paragraph M_Y_Y - Check £100,000 compensation limit__",436248576,20992000,"436248576Y20992000N","Y",null,null,null,null,null,null,null,null,null,null,"N","Y","N","Y",null,null,null,null,null,null,"N",null,"N","Y",null,"Y","Y"]
[0,"704684032Y289427456N",16,"Scheme - alpha or partnership","alpha","alpha Paragraph E","Y",null,null,null,null,null,"Scheme - alpha or partnership_alpha_alpha Paragraph E_Y___",704684032,289427456,"704684032Y289427456N","Y",null,null,null,null,null,null,null,null,null,null,"N","Y","N","Y",null,null,null,null,null,null,"N",null,"N","Y",null,"Y","N","Y"]
[0,"167813120Y826298368N",17,"Scheme - alpha or partnership","alpha","alpha Paragraph E","Y",null,null,null,null,null,"Scheme - alpha or partnership_alpha_alpha Paragraph E_Y___",167813120,826298368,"167813120Y826298368N","Y",null,null,null,null,null,null,null,null,null,null,"N","Y","N","Y",null,null,null,null,null,null,"N",null,"N","Y",null,"Y","N","N"]
[0,"302030848Y155209728N",18,"Scheme - alpha or partnership","alpha","alpha Paragraph M",null,null,null,null,null,null,"Scheme - alpha or partnership_alpha_alpha Paragraph M____",302030848,155209728,"302030848Y155209728N","Y",null,null,null,null,null,null,null,null,null,null,"N","Y","N","Y",null,null,null,null,null,null,"N",null,"N","Y",null,"N","Y"]
[0,"1644208128Y423645184N",19,"Scheme - alpha or partnership","alpha","alpha Paragraph A",null,null,null,null,null,null,"Scheme - alpha or partnership_alpha_alpha Paragraph A____",1644208128,423645184,"1644208128Y423645184N","Y",null,null,null,null,null,null,null,null,null,null,"N","Y","N","Y",null,null,null,null,null,null,"N",null,"N","Y",null,"N","N","Y","Y"]
[0,"570466304Y1497387008N",20,"Scheme - alpha or partnership","alpha","alpha Paragraph G",null,null,null,null,null,"This is a rejoiner, Mark as R on the interface","Scheme - alpha or partnership_alpha_alpha Paragraph G____",570466304,1497387008,"570466304Y1497387008N","Y",null,null,null,null,null,null,null,null,null,null,"N","Y","N","Y",null,null,null,null,null,null,"N",null,"N","Y",null,"N","N","Y","N"]
[0,"33595392Y960516096N",21,"Scheme - alpha or partnership","alpha","alpha Paragraph A",null,null,null,null,null,null,"Scheme - alpha or partnership_alpha_alpha Paragraph A____",33595392,960516096,"33595392Y960516096N","Y",null,null,null,null,null,null,null,null,null,null,"N","Y","N","Y",null,null,null,null,null,null,"N",null,"N","Y",null,"N","N","N"]
[0,"134258688Y54546432N",22,"Scheme - alpha or partnership","alpha","alpha Paragraph E","Y",null,null,null,null,null,"Scheme - alpha or partnership_alpha_alpha Paragraph E_Y___",134258688,54546432,"134258688Y54546432N","Y",null,null,null,null,null,null,null,null,null,null,"N","Y","N","Y",null,null,null,null,null,null,"N",null,"N","N",null,"Y"]
[0,"1610653696Y188764160N",23,"Scheme - alpha or partnership","alpha","alpha Paragraph A",null,null,null,null,null,null,"Scheme - alpha or partnership_alpha_alpha Paragraph A____",1610653696,188764160,"1610653696Y188764160N","Y",null,null,null,null,null,null,null,null,null,null,"N","Y","N","Y",null,null,null,null,null,null,"N",null,"N","N",null,"N",null,"Y","Y"]
[0,"536911872Y1262505984N",24,"Scheme - alpha or partnership","alpha","alpha Paragraph A",null,null,null,null,null,null,"Scheme - alpha or partnership_alpha_alpha Paragraph A____",536911872,1262505984,"536911872Y1262505984N","Y",null,null,null,null,null,null,null,null,null,null,"N","Y","N","Y",null,null,null,null,null,null,"N",null,"N","N",null,"N",null,"Y","N"]
[0,"40960Y725635072N",25,"Scheme - alpha or partnership","alpha","alpha Paragraph A",null,null,null,null,null,null,"Scheme - alpha or partnership_alpha_alpha Paragraph A____",40960,725635072,"40960Y725635072N","Y",null,null,null,null,null,null,null,null,null,null,"N","Y","N","Y",null,null,null,null,null,null,"N",null,"N","N",null,"N",null,"N"]
[0,"457220096Y20480N",26,"Scheme - alpha or partnership","alpha","alpha Paragraph M","Y","Y - Check £100,000 compensation limit",null,null,null,null,"Scheme - alpha or partnership_alpha_alpha Paragraph M_Y_Y - Check £100,000 compensation limit__",457220096,20480,"457220096Y20480N","Y",null,null,null,null,null,null,null,null,null,null,"N","Y","N","Y",null,null,null,null,null,null,"Y",null,"Y","Y",null,"Y","Y"]
[0,"188784640Y268455936N",27,"Scheme - alpha or partnership","alpha","alpha Paragraph E","Y",null,null,null,null,null,"Scheme - alpha or partnership_alpha_alpha Paragraph E_Y___",188784640,268455936,"188784640Y268455936N","Y",null,null,null,null,null,null,null,null,null,null,"N","Y","N","Y",null,null,null,null,null,null,"Y",null,"Y","Y",null,"Y","N"]
[0,"323002368Y134238208N",28,"Scheme - alpha or partnership","alpha","alpha Paragraph M",null,"Y - Check £100,000 compensation limit",null,null,"Complete Declaration",null,"Scheme - alpha or partnership_alpha_alpha Paragraph M__Y - Check £100,000 compensation limit__",323002368,134238208,"323002368Y134238208N","Y",null,null,null,null,null,null,null,null,null,null,"N","Y","N","Y",null,null,null,null,null,null,"Y",null,"Y","Y",null,"N","Y"]
[0,"54566912Y402673664N",29,"Scheme - alpha or partnership","alpha","alpha Paragraph A",null,null,null,null,null,null,"Scheme - alpha or partnership_alpha_alpha Paragraph A____",54566912,402673664,"54566912Y402673664N","Y",null,null,null,null,null,null,null,null,null,null,"N","Y","N","Y",null,null,null,null,null,null,"Y",null,"Y","Y",null,"N","N"]
[0,"155230208Y33574912N",30,"Scheme - alpha or partnership","alpha","alpha Paragraph E","Y",null,null,null,null,null,"Scheme - alpha or partnership_alpha_alpha Paragraph E_Y___",155230208,33574912,"155230208Y33574912N","Y",null,null,null,null,null,null,null,null,null,null,"N","Y","N","Y",null,null,null,null,null,null,"Y",null,"Y","N",null,"Y"]
[0,"21012480Y167792640N",31,"Scheme - alpha or partnership","alpha","alpha Paragraph A",null,null,null,null,null,null,"Scheme - alpha or partnership_alpha_alpha Paragraph A____",21012480,167792640,"21012480Y167792640N","Y",null,null,null,null,null,null,null,null,null,null,"N","Y","N","Y",null,null,null,null,null,null,"Y",null,"Y","N",null,"N"]
[0,"440442880Y16797696N",32,"Scheme - alpha or partnership","alpha","alpha Paragraph M","Y","Y - Check £100,000 compensation limit",null,null,"Complete Declaration",null,"Scheme - alpha or partnership_alpha_alpha Paragraph M_Y_Y - Check £100,000 compensation limit__",440442880,16797696,"440442880Y16797696N","Y",null,null,null,null,null,null,null,null,null,null,"N","Y","N","Y",null,null,null,null,null,null,"Y",null,"N","Y",null,"Y","Y"]
[{"$f":"IF(B143=\"0Y0N\",0,COUNTIF($B$111:$B$233,B143)-1)","v":0},{"$f":"P143","v":"708878336Y285233152N"},33,"Scheme - alpha or partnership","alpha","alpha Paragraph E","Y",null,null,null,null,null,{"$f":"D143&\"_\"&E143&\"_\"&F143&\"_\"&G143&\"_\"&H143&\"_\"&I143&\"_\"","v":"Scheme - alpha or partnership_alpha_alpha Paragraph E_Y___"},{"$f":"SUMIF(Q143:AW143,\"Y\",$Q$100:$AH$100)","v":708878336},{"$f":"SUMIF(Q143:AW143,\"N\",$Q$100:$AH$100)","v":285233152},{"$f":"N143&\"Y\"&O143&\"N\"","v":"708878336Y285233152N"},"Y",null,null,null,null,null,null,null,null,null,null,"N","Y","N","Y",null,null,null,null,null,null,"Y",null,"N","Y",null,"Y","N","Y"]
[0,"172007424Y822104064N",34,"Scheme - alpha or partnership","alpha","alpha Paragraph E","Y",null,null,null,null,null,"Scheme - alpha or partnership_alpha_alpha Paragraph E_Y___",172007424,822104064,"172007424Y822104064N","Y",null,null,null,null,null,null,null,null,null,null,"N","Y","N","Y",null,null,null,null,null,null,"Y",null,"N","Y",null,"Y","N","N"]
[0,"306225152Y151015424N",35,"Scheme - alpha or partnership","alpha","alpha Paragraph M",null,null,null,null,null,null,"Scheme - alpha or partnership_alpha_alpha Paragraph M____",306225152,151015424,"306225152Y151015424N","Y",null,null,null,null,null,null,null,null,null,null,"N","Y","N","Y",null,null,null,null,null,null,"Y",null,"N","Y",null,"N","Y"]
[0,"1648402432Y419450880N",36,"Scheme - alpha or partnership","alpha","alpha Paragraph M",null,null,null,null,null,null,"Scheme - alpha or partnership_alpha_alpha Paragraph M____",1648402432,419450880,"1648402432Y419450880N","Y",null,null,null,null,null,null,null,null,null,null,"N","Y","N","Y",null,null,null,null,null,null,"Y",null,"N","Y",null,"N","N","Y","Y"]
[0,"574660608Y1493192704N",37,"Scheme - alpha or partnership","alpha","alpha Paragraph G",null,null,null,null,null,"This is a rejoiner, Mark as R on the interface","Scheme - alpha or partnership_alpha_alpha Paragraph G____",574660608,1493192704,"574660608Y1493192704N","Y",null,null,null,null,null,null,null,null,null,null,"N","Y","N","Y",null,null,null,null,null,null,"Y",null,"N","Y",null,"N","N","Y","N"]
[0,"37789696Y956321792N",38,"Scheme - alpha or partnership","alpha","alpha Paragraph A",null,null,null,null,null,null,"Scheme - alpha or partnership_alpha_alpha Paragraph A____",37789696,956321792,"37789696Y956321792N","Y",null,null,null,null,null,null,null,null,null,null,"N","Y","N","Y",null,null,null,null,null,null,"Y",null,"N","Y",null,"N","N","N"]
[0,"138452992Y50352128N",39,"Scheme - alpha or partnership","alpha","alpha Paragraph E","Y",null,null,null,null,null,"Scheme - alpha or partnership_alpha_alpha Paragraph E_Y___",138452992,50352128,"138452992Y50352128N","Y",null,null,null,null,null,null,null,null,null,null,"N","Y","N","Y",null,null,null,null,null,null,"Y",null,"N","N",null,"Y"]
[0,"1614848000Y184569856N",40,"Scheme - alpha or partnership","alpha","alpha Paragraph A",null,null,null,null,null,null,"Scheme - alpha or partnership_alpha_alpha Paragraph A____",1614848000,184569856,"1614848000Y184569856N","Y",null,null,null,null,null,null,null,null,null,null,"N","Y","N","Y",null,null,null,null,null,null,"Y",null,"N","N",null,"N",null,"Y","Y"]
[0,"541106176Y1258311680N",41,"Scheme - alpha or partnership","alpha","alpha Paragraph G",null,null,null,null,null,"This is a rejoiner, Mark as R on the interface","Scheme - alpha or partnership_alpha_alpha Paragraph G____",541106176,1258311680,"541106176Y1258311680N","Y",null,null,null,null,null,null,null,null,null,null,"N","Y","N","Y",null,null,null,null,null,null,"Y",null,"N","N",null,"N",null,"Y","N"]
[0,"4235264Y721440768N",42,"Scheme - alpha or partnership","alpha","alpha Paragraph G",null,null,null,null,null,null,"Scheme - alpha or partnership_alpha_alpha Paragraph G____",4235264,721440768,"4235264Y721440768N","Y",null,null,null,null,null,null,null,null,null,null,"N","Y","N","Y",null,null,null,null,null,null,"Y",null,"N","N",null,"N",null,"N"]
[0,"73728Y53248N",43,"Scheme - alpha or partnership","alpha","alpha Paragraph E","Y",null,null,null,null,null,"Scheme - alpha or partnership_alpha_alpha Paragraph E_Y___",73728,53248,"73728Y53248N","Y",null,null,null,null,null,null,null,null,null,null,"N","Y","N","N","Y"]
[0,"139264Y118784N",44,"Scheme - alpha or partnership","alpha","alpha Paragraph E","Y",null,null,null,null,null,"Scheme - alpha or partnership_alpha_alpha Paragraph E_Y___",139264,118784,"139264Y118784N","Y",null,null,null,null,null,null,null,null,null,null,"N","Y","N","N","N","Y"]
[0,"8658944Y249856N",45,"Scheme - alpha or partnership","alpha","alpha Paragraph F","Y",null,null,null,null,null,"Scheme - alpha or partnership_alpha_alpha Paragraph F_Y___",8658944,249856,"8658944Y249856N","Y",null,null,null,null,null,null,null,null,null,null,"N","Y","N","N","N","N","Y",null,null,null,null,"Y"]
[0,"2147753984Y8638464N",46,"Scheme - alpha or partnership","alpha","alpha Paragraph F","Y",null,null,null,null,null,"Scheme - alpha or partnership_alpha_alpha Paragraph F_Y___",2147753984,8638464,"2147753984Y8638464N","Y",null,null,null,null,null,null,null,null,null,null,"N","Y","N","N","N","N","Y",null,null,null,null,"N",null,null,null,null,null,null,null,"Y"]
[0,"270336Y2156122112N",47,"Not eligible, Ill health assesment required refer to MyCSP",null,null,null,null,null,null,null,null,"Not eligible, Ill health assesment required refer to MyCSP______",270336,2156122112,"270336Y2156122112N","Y",null,null,null,null,null,null,null,null,null,null,"N","Y","N","N","N","N","Y",null,null,null,null,"N",null,null,null,null,null,null,null,"N"]
[0,"532480Y512000N",48,"Scheme - alpha or partnership","alpha","alpha Paragraph E","Y",null,null,null,null,null,"Scheme - alpha or partnership_alpha_alpha Paragraph E_Y___",532480,512000,"532480Y512000N","Y",null,null,null,null,null,null,null,null,null,null,"N","Y","N","N","N","N","N","Y"]
[0,"202383360Y1036288N",49,"Scheme - alpha or partnership","alpha","alpha Paragraph E","Y","Y - Check £100,000 compensation limit","Y",null,"Complete Declaration",null,"Scheme - alpha or partnership_alpha_alpha Paragraph E_Y_Y - Check £100,000 compensation limit_Y_",202383360,1036288,"202383360Y1036288N","Y",null,null,null,null,null,null,null,null,null,null,"N","Y","N","N","N","N","N","N","Y",null,null,null,null,null,"Y","Y"]
[0,"68165632Y135254016N",50,"Scheme - alpha or partnership","alpha","alpha Paragraph A",null,"Check £100,000 compensation limit","Y",null,null,null,"Scheme - alpha or partnership_alpha_alpha Paragraph A__Check £100,000 compensation limit_Y_",68165632,135254016,"68165632Y135254016N","Y",null,null,null,null,null,null,null,null,null,null,"N","Y","N","N","N","N","N","N","Y",null,null,null,null,null,"Y","N"]
[0,"403709952Y68145152N",51,"Scheme - alpha or partnership","alpha","alpha Paragraph M","Y","Y - Check £100,000 compensation limit","Y",null,"Complete Declaration",null,"Scheme - alpha or partnership_alpha_alpha Paragraph M_Y_Y - Check £100,000 compensation limit_Y_",403709952,68145152,"403709952Y68145152N","Y",null,null,null,null,null,null,null,null,null,null,"N","Y","N","N","N","N","N","N","Y",null,null,null,null,null,"N","Y","Y"]
[0,"135274496Y336580608N",52,"Scheme - alpha or partnership","alpha","alpha Paragraph E","Y"," Check £100,000 compensation limit","Y",null,"Complete Declaration",null,"Scheme - alpha or partnership_alpha_alpha Paragraph E_Y_ Check £100,000 compensation limit_Y_",135274496,336580608,"135274496Y336580608N","Y",null,null,null,null,null,null,null,null,null,null,"N","Y","N","N","N","N","N","N","Y",null,null,null,null,null,"N","Y","N"]
[0,"269492224Y202362880N",53,"Scheme - alpha or partnership","alpha","alpha Paragraph M",null,"Y - Check £100,000 compensation limit","Y",null,"Complete Declaration",null,"Scheme - alpha or partnership_alpha_alpha Paragraph M__Y - Check £100,000 compensation limit_Y_",269492224,202362880,"269492224Y202362880N","Y",null,null,null,null,null,null,null,null,null,null,"N","Y","N","N","N","N","N","N","Y",null,null,null,null,null,"N","N","Y"]
[0,"1056768Y470798336N",54,"Scheme - alpha or partnership","alpha","alpha Paragraph A",null,"Check £100,000 compensation limit","Y",null,null,null,"Scheme - alpha or partnership_alpha_alpha Paragraph A__Check £100,000 compensation limit_Y_",1056768,470798336,"1056768Y470798336N","Y",null,null,null,null,null,null,null,null,null,null,"N","Y","N","N","N","N","N","N","Y",null,null,null,null,null,"N","N","N"]
[0,"203431936Y2084864N",55,"Scheme - alpha or partnership","alpha","alpha Paragraph M","Y","Y - Check £100,000 compensation limit",null,null,"Complete Declaration",null,"Scheme - alpha or partnership_alpha_alpha Paragraph M_Y_Y - Check £100,000 compensation limit__",203431936,2084864,"203431936Y2084864N","Y",null,null,null,null,null,null,null,null,null,null,"N","Y","N","N","N","N","N","N","N","Y",null,null,null,null,"Y","Y"]
[0,"69214208Y136302592N",56,"Scheme - alpha or partnership","alpha","alpha Paragraph A",null,"Check £100,000 compensation limit",null,null,null,null,"Scheme - alpha or partnership_alpha_alpha Paragraph A__Check £100,000 compensation limit__",69214208,136302592,"69214208Y136302592N","Y",null,null,null,null,null,null,null,null,null,null,"N","Y","N","N","N","N","N","N","N","Y",null,null,null,null,"Y","N"]
[0,"404758528Y69193728N",57,"Scheme - alpha or partnership","alpha","alpha Paragraph M","Y","Y - Check £100,000 compensation limit",null,null,"Complete Declaration",null,"Scheme - alpha or partnership_alpha_alpha Paragraph M_Y_Y - Check £100,000 compensation limit__",404758528,69193728,"404758528Y69193728N","Y",null,null,null,null,null,null,null,null,null,null,"N","Y","N","N","N","N","N","N","N","Y",null,null,null,null,"N","Y","Y"]
[0,"136323072Y337629184N",58,"Scheme - alpha or partnership","alpha","alpha Paragraph E","Y","Check £100,000 compensation limit",null,null,"Complete Declaration",null,"Scheme - alpha or partnership_alpha_alpha Paragraph E_Y_Check £100,000 compensation limit__",136323072,337629184,"136323072Y337629184N","Y",null,null,null,null,null,null,null,null,null,null,"N","Y","N","N","N","N","N","N","N","Y",null,null,null,null,"N","Y","N"]
[0,"270540800Y203411456N",59,"Scheme - alpha or partnership","alpha","alpha Paragraph M",null,"Y - Check £100,000 compensation limit",null,null,"Complete Declaration",null,"Scheme - alpha or partnership_alpha_alpha Paragraph M__Y - Check £100,000 compensation limit__",270540800,203411456,"270540800Y203411456N","Y",null,null,null,null,null,null,null,null,null,null,"N","Y","N","N","N","N","N","N","N","Y",null,null,null,null,"N","N","Y"]
[0,"2105344Y471846912N",60,"Scheme - alpha or partnership","alpha","alpha Paragraph A",null,null,null,null,null,null,"Scheme - alpha or partnership_alpha_alpha Paragraph A____",2105344,471846912,"2105344Y471846912N","Y",null,null,null,null,null,null,null,null,null,null,"N","Y","N","N","N","N","N","N","N","Y",null,null,null,null,"N","N","N"]
[28,0,0,"Not Found Carry On",null,null,null,null,null,null,null,null,{"$f":"#REF!&\"_\"&E171&\"_\"&F171&\"_\"&G171&\"_\"&H171&\"_\"&I171&\"_\"","v":{"$error":"#REF!"}},0,0]
[28,0,0,"Not Found Carry On",null,null,null,null,null,null,null,null,{"$f":"D172&\"_\"&D171&\"_\"&F172&\"_\"&G172&\"_\"&H172&\"_\"&I172&\"_\"","v":"Not Found Carry On_Not Found Carry On_____"},0,0]
[28,0,0,"Not Found Carry On",null,null,null,null,null,null,null,null,"Not Found Carry On______",0,0]
[28,0,0,"Not Found Carry On",null,null,null,null,null,null,null,null,"Not Found Carry On______",0,0]
[{"$f":"IF(B175=\"0Y0N\",0,COUNTIF($B$111:$B$233,B175)-1)","v":28},{"$f":"P175","v":0},0,"Not Found Carry On",null,null,null,null,null,null,null,null,"Not Found Carry On______",{"$f":"SUMIF(Q175:AW175,\"Y\",$Q$100:$AH$100)","v":0},{"$f":"SUMIF(Q175:AW175,\"N\",$Q$100:$AH$100)","v":0}]
[28,0,0,"Not Found Carry On",null,null,null,null,null,null,null,null,"Not Found Carry On______",0,0]
[28,0,0,"Not Found Carry On",null,null,null,null,null,null,null,null,"Not Found Carry On______",0,0]
[0,"69632Y57344N",68,"Scheme - alpha or partnership","alpha","alpha Paragraph E","Y",null,null,null,null,null,"Scheme - alpha or partnership_alpha_alpha Paragraph E_Y___",69632,57344,{"$f":"N178&\"Y\"&O178&\"N\"","v":"69632Y57344N"},"Y",null,null,null,null,null,null,null,null,null,null,"Y","N","N","N","Y"]
[0,"135168Y122880N",69,"Scheme - alpha or partnership","alpha","alpha Paragraph E","Y",null,null,null,null,null,"Scheme - alpha or partnership_alpha_alpha Paragraph E_Y___",135168,122880,"135168Y122880N","Y",null,null,null,null,null,null,null,null,null,null,"Y","N","N","N","N","Y"]
[0,"2147749888Y253952N",70,"Scheme - alpha or partnership","alpha","alpha Paragraph F","Y",null,null,null,null,null,"Scheme - alpha or partnership_alpha_alpha Paragraph F_Y___",2147749888,253952,"2147749888Y253952N","Y",null,null,null,null,null,null,null,null,null,null,"Y","N","N","N","N","N","Y",null,null,null,null,null,null,null,null,null,null,null,null,"Y"]
[0,"266240Y2147737600N",71,"Not Eligibile",null,"alpha Paragraph ",null,null,null,null,null,null,"Not Eligibile__alpha Paragraph ____",266240,2147737600,"266240Y2147737600N","Y",null,null,null,null,null,null,null,null,null,null,"Y","N","N","N","N","N","Y",null,null,null,null,null,null,null,null,null,null,null,null,"N"]
[0,"528384Y516096N",72,"Scheme - alpha or partnership","alpha","alpha Paragraph E","Y",null,null,null,null,null,"Scheme - alpha or partnership_alpha_alpha Paragraph E_Y___",528384,516096,"528384Y516096N","Y",null,null,null,null,null,null,null,null,null,null,"Y","N","N","N","N","N","N","Y"]
[0,"134238208Y8192N",73,"Scheme - alpha or partnership","alpha","alpha Paragraph E","Y",null,null,null,null,null,"Scheme - alpha or partnership_alpha_alpha Paragraph E_Y___",134238208,8192,"134238208Y8192N","Y",null,null,null,null,null,null,null,null,null,null,"Y","N","Y",null,null,null,null,null,null,null,null,null,null,null,null,"Y"]
[0,"20480Y134225920N",74,"Scheme - alpha or partnership","alpha","alpha Paragraph A",null,null,null,null,null,null,{"$f":"D184&\"_\"&E184&\"_\"&F184&\"_\"&G184&\"_\"&H184&\"_\"&I184&\"_\"","v":"Scheme - alpha or partnership_alpha_alpha Paragraph A____"},20480,134225920,"20480Y134225920N","Y",null,null,null,null,null,null,null,null,null,null,"Y","N","Y",null,null,null,null,null,null,null,null,null,null,null,null,"N"]
[0,"436244480Y24576N",75,"Scheme - alpha or partnership","alpha","alpha Paragraph M","Y","Y - Check £100,000 compensation limit",null,null,"Complete Declaration, Reassess ill health payment, refer to MyCSP",null,"Scheme - alpha or partnership_alpha_alpha Paragraph M_Y_Y - Check £100,000 compensation limit__",436244480,24576,"436244480Y24576N","Y",null,null,null,null,null,null,null,null,null,null,"Y","N","N","Y",null,null,null,null,null,null,null,null,null,"Y",null,"Y","Y"]
[0,"167809024Y268460032N",76,"Scheme - alpha or partnership","alpha","alpha Paragraph E","Y",null,null,null,null,null,"Scheme - alpha or partnership_alpha_alpha Paragraph E_Y___",167809024,268460032,"167809024Y268460032N","Y",null,null,null,null,null,null,null,null,null,null,"Y","N","N","Y",null,null,null,null,null,null,null,null,null,"Y",null,"Y","N"]
[0,"302026752Y134242304N",77,"Scheme - alpha or partnership","alpha","alpha Paragraph M",null,"Y - Check £100,000 compensation limit",null,null,"Complete Declaration",null,"Scheme - alpha or partnership_alpha_alpha Paragraph M__Y - Check £100,000 compensation limit__",302026752,134242304,"302026752Y134242304N","Y",null,null,null,null,null,null,null,null,null,null,"Y","N","N","Y",null,null,null,null,null,null,null,null,null,"Y",null,"N","Y"]
[0,"33591296Y402677760N",78,"Scheme - alpha or partnership","alpha","alpha Paragraph A",null,null,null,null,null,null,"Scheme - alpha or partnership_alpha_alpha Paragraph A____",33591296,402677760,"33591296Y402677760N","Y",null,null,null,null,null,null,null,null,null,null,"Y","N","N","Y",null,null,null,null,null,null,null,null,null,"Y",null,"N","N"]
[0,"134254592Y33579008N",79,"Scheme - alpha or partnership","alpha","alpha Paragraph E","Y",null,null,null,null,null,"Scheme - alpha or partnership_alpha_alpha Paragraph E_Y___",134254592,33579008,"134254592Y33579008N","Y",null,null,null,null,null,null,null,null,null,null,"Y","N","N","Y",null,null,null,null,null,null,null,null,null,"N",null,"Y"]
[0,"36864Y167796736N",80,"Scheme - alpha or partnership","alpha","alpha Paragraph A",null,null,null,null,null,null,"Scheme - alpha or partnership_alpha_alpha Paragraph A____",36864,167796736,"36864Y167796736N","Y",null,null,null,null,null,null,null,null,null,null,"Y","N","N","Y",null,null,null,null,null,null,null,null,null,"N",null,"N"]
[0,"202379264Y1040384N",81,"Scheme - alpha or partnership","alpha","alpha Paragraph E","Y","Y - Check £100,000 compensation limit","Y",null,"Complete Declaration",null,"Scheme - alpha or partnership_alpha_alpha Paragraph E_Y_Y - Check £100,000 compensation limit_Y_",202379264,1040384,"202379264Y1040384N","Y",null,null,null,null,null,null,null,null,null,null,"Y","N","N","N","N","N","N","N","Y",null,null,null,null,null,"Y","Y"]
[0,"68161536Y135258112N",82,"Scheme - alpha or partnership","alpha","alpha Paragraph A",null,"Y - Check £100,000 compensation limit","Y",null,null,null,"Scheme - alpha or partnership_alpha_alpha Paragraph A__Y - Check £100,000 compensation limit_Y_",68161536,135258112,"68161536Y135258112N","Y",null,null,null,null,null,null,null,null,null,null,"Y","N","N","N","N","N","N","N","Y",null,null,null,null,null,"Y","N"]
[0,"403705856Y68149248N",83,"Scheme - alpha or partnership","alpha","alpha Paragraph M","Y","Y - Check £100,000 compensation limit","Y",null,"Complete Declaration",null,"Scheme - alpha or partnership_alpha_alpha Paragraph M_Y_Y - Check £100,000 compensation limit_Y_",403705856,68149248,"403705856Y68149248N","Y",null,null,null,null,null,null,null,null,null,null,"Y","N","N","N","N","N","N","N","Y",null,null,null,null,null,"N","Y","Y"]
[0,"135270400Y336584704N",84,"Scheme - alpha or partnership","alpha","alpha Paragraph E","Y","Y - Check £100,000 compensation limit","Y",null,"Complete Declaration",null,"Scheme - alpha or partnership_alpha_alpha Paragraph E_Y_Y - Check £100,000 compensation limit_Y_",135270400,336584704,"135270400Y336584704N","Y",null,null,null,null,null,null,null,null,null,null,"Y","N","N","N","N","N","N","N","Y",null,null,null,null,null,"N","Y","N"]
[0,"269488128Y202366976N",85,"Scheme - alpha or partnership","alpha","alpha Paragraph M",null,"Y - Check £100,000 compensation limit","Y",null,"Complete Declaration",null,"Scheme - alpha or partnership_alpha_alpha Paragraph M__Y - Check £100,000 compensation limit_Y_",269488128,202366976,"269488128Y202366976N","Y",null,null,null,null,null,null,null,null,null,null,"Y","N","N","N","N","N","N","N","Y",null,null,null,null,null,"N","N","Y"]
[0,"1052672Y470802432N",86,"Scheme - alpha or partnership","alpha","alpha Paragraph A",null,"Y - Check £100,000 compensation limit","Y",null,null,null,"Scheme - alpha or partnership_alpha_alpha Paragraph A__Y - Check £100,000 compensation limit_Y_",1052672,470802432,"1052672Y470802432N","Y",null,null,null,null,null,null,null,null,null,null,"Y","N","N","N","N","N","N","N","Y",null,null,null,null,null,"N","N","N"]
[0,"69210112Y2088960N",87,"Scheme - alpha or partnership","alpha","alpha Paragraph E","Y","Y - Check £100,000 compensation limit","Y",null,"Complete Declaration",null,"Scheme - alpha or partnership_alpha_alpha Paragraph E_Y_Y - Check £100,000 compensation limit_Y_",69210112,2088960,"69210112Y2088960N","Y",null,null,null,null,null,null,null,null,null,null,"Y","N","N","N","N","N","N","N","N","Y",null,null,null,null,"Y"]
[0,"2101248Y69197824N",88,"Scheme - alpha or partnership","alpha","alpha Paragraph A",null,"Y - Check £100,000 compensation limit",null,null,null,null,"Scheme - alpha or partnership_alpha_alpha Paragraph A__Y - Check £100,000 compensation limit__",2101248,69197824,"2101248Y69197824N","Y",null,null,null,null,null,null,null,null,null,null,"Y","N","N","N","N","N","N","N","N","Y",null,null,null,null,"N"]
[0,"404754432Y69197824N",89,"Scheme - alpha or partnership","alpha","alpha Paragraph M","Y","Y - Check £100,000 compensation limit",null,null,"Complete Declaration",null,"Scheme - alpha or partnership_alpha_alpha Paragraph M_Y_Y - Check £100,000 compensation limit__",404754432,69197824,"404754432Y69197824N","Y",null,null,null,null,null,null,null,null,null,null,"Y","N","N","N","N","N","N","N","N","Y",null,null,null,null,"N","Y","Y"]
[0,"136318976Y337633280N",90,"Scheme - alpha or partnership","alpha","alpha Paragraph E","Y",".",null,null,"Complete Declaration",null,"Scheme - alpha or partnership_alpha_alpha Paragraph E_Y_.__",136318976,337633280,"136318976Y337633280N","Y",null,null,null,null,null,null,null,null,null,null,"Y","N","N","N","N","N","N","N","N","Y",null,null,null,null,"N","Y","N"]
[0,"270536704Y203415552N",91,"Scheme - alpha or partnership","alpha","alpha Paragraph M",null,"Y - Check £100,000 compensation limit",null,null,"Complete Declaration",null,"Scheme - alpha or partnership_alpha_alpha Paragraph M__Y - Check £100,000 compensation limit__",270536704,203415552,"270536704Y203415552N","Y",null,null,null,null,null,null,null,null,null,null,"Y","N","N","N","N","N","N","N","N","Y",null,null,null,null,"N","N","Y"]
[0,"2101248Y471851008N",92,"Scheme - alpha or partnership","alpha","alpha Paragraph A",null,null,null,null,null,null,{"$f":"D202&\"_\"&E202&\"_\"&F202&\"_\"&G202&\"_\"&H202&\"_\"&I202&\"_\"","v":"Scheme - alpha or partnership_alpha_alpha Paragraph A____"},2101248,471851008,"2101248Y471851008N","Y",null,null,null,null,null,null,null,null,null,null,"Y","N","N","N","N","N","N","N","N","Y",null,null,null,null,"N","N","N"]
[28,0,93,"ALPHA REJOINER - Not used Logic Tree",null,null,null,null,null,null,null,null,"ALPHA REJOINER - Not used Logic Tree______",0,0]
[28,0,94,"PCSPS REJOINER - Not used Logic Tree",null,null,null,null,null,null,null,null,"PCSPS REJOINER - Not used Logic Tree______",0,0]
[28,0,95,"ALPHA REJOINER - Not used Logic Tree",null,null,null,null,null,null,null,null,"ALPHA REJOINER - Not used Logic Tree______",0,0]
[28,0,96,"PCSPS REJOINER - Not used Logic Tree",null,null,null,null,null,null,null,null,"PCSPS REJOINER - Not used Logic Tree______",0,0]
[{"$f":"IF(B207=\"0Y0N\",0,COUNTIF($B$111:$B$233,B207)-1)","v":28},{"$f":"P207","v":0},97,"ALPHA REJOINER - Not used Logic Tree",null,null,null,null,null,null,null,null,"ALPHA REJOINER - Not used Logic Tree______",{"$f":"SUMIF(Q207:AW207,\"Y\",$Q$100:$AH$100)","v":0},{"$f":"SUMIF(Q207:AW207,\"N\",$Q$100:$AH$100)","v":0}]
[28,0,98,"ALPHA REJOINER - Not used Logic Tree",null,null,null,null,null,null,null,null,"ALPHA REJOINER - Not used Logic Tree______",0,0]
[28,0,99,"ALPHA REJOINER - Not used Logic Tree",null,null,null,null,null,null,null,null,"ALPHA REJOINER - Not used Logic Tree______",0,0]
[0,"4Y12592N",100,"Scheme - alpha or partnership","alpha","alpha Paragraph A",null,null,null,null,null,null,{"$f":"E210&\"_\"&F210&\"_\"&G210&\"_\"&H210&\"_\"&I210&\"_\"&J210&\"_\"","v":"alpha_alpha Paragraph A_____"},4,12592,{"$f":"N210&\"Y\"&O210&\"N\"","v":"4Y12592N"},"Y","Y",null,"N","N",null,null,"N",null,null,null,"N","N"]
[0,"8Y12596N",101,"Scheme - alpha or partnership","alpha","alpha Paragraph A",null,null,null,null,null,null,{"$f":"D211&\"_\"&E211&\"_\"&F211&\"_\"&G211&\"_\"&H211&\"_\"&I211&\"_\"","v":"Scheme - alpha or partnership_alpha_alpha Paragraph A____"},8,12596,"8Y12596N","Y","N","Y","N","N",null,null,"N",null,null,null,"N","N"]
[0,"744Y12564N",61,"Scheme - alpha or partnership","alpha","alpha Paragraph A",null,null,null,null,null,null,"Scheme - alpha or partnership_alpha_alpha Paragraph A____",744,12564,"744Y12564N","Y","N","Y","N","Y","Y","Y","N","Y",null,null,"N","N"]
[0,"232Y13076N",62,"Scheme - alpha or partnership","alpha","alpha Paragraph A",null,null,null,null,null,null,"Scheme - alpha or partnership_alpha_alpha Paragraph A____",232,13076,"232Y13076N","Y","N","Y","N","Y","Y","Y","N","N",null,null,"N","N"]
[0,"1128Y13204N",63,"Scheme - alpha or partnership","alpha","alpha Paragraph A",null,null,null,null,null,null,"Scheme - alpha or partnership_alpha_alpha Paragraph A____",1128,13204,"1128Y13204N","Y","N","Y","N","Y","Y","N","N","N","Y",null,"N","N"]
[0,"104Y14228N",64,"Scheme - alpha or partnership","alpha","alpha Paragraph A",null,null,null,null,null,null,"Scheme - alpha or partnership_alpha_alpha Paragraph A____",104,14228,"104Y14228N","Y","N","Y","N","Y","Y","N","N","N","N",null,"N","N"]
[0,"1128Y12692N",65,"Scheme - alpha or partnership","alpha","alpha Paragraph A",null,null,null,null,null,null,"Scheme - alpha or partnership_alpha_alpha Paragraph A____",1128,12692,"1128Y12692N","Y","N","Y","N","Y","Y","N","N",null,"Y",null,"N","N"]
[0,"40Y12628N",66,"Scheme - alpha or partnership","alpha","alpha Paragraph A",null,null,null,null,null,null,"Scheme - alpha or partnership_alpha_alpha Paragraph A____",40,12628,"40Y12628N","Y","N","Y","N","Y","N",null,"N",null,null,null,"N","N"]
[0,"0Y12572N",67,"Scheme - alpha or partnership","alpha","alpha Paragraph A",null,null,null,null,null,null,"Scheme - alpha or partnership_alpha_alpha Paragraph A____",0,12572,"0Y12572N","Y","N","N","N",null,null,null,"N",null,null,null,"N","N"]
[28,0,102,"Scheme - alpha or partnership","alpha","alpha Paragraph A",null,null,null,null,null,null,{"$f":"E219&\"_\"&F219&\"_\"&G219&\"_\"&H219&\"_\"&I219&\"_\"&J219&\"_\"","v":"alpha_alpha Paragraph A_____"},0,0]
[{"$f":"IF(B220=\"0Y0N\",0,COUNTIF($B$111:$B$233,B220)-1)","v":28},{"$f":"P220","v":0},110,null,null,null,null,null,null,null,null,null,{"$f":"D220&\"_\"&E220&\"_\"&F220&\"_\"&G220&\"_\"&H220&\"_\"&I220&\"_\"","v":"______"},{"$f":"SUMIF(Q220:AW220,\"Y\",$Q$100:$AH$100)","v":0},{"$f":"SUMIF(Q220:AW220,\"N\",$Q$100:$AH$100)","v":0}]
[{"$f":"IF(B221=\"0Y0N\",0,COUNTIF($B$111:$B$233,B221)-1)","v":28},{"$f":"P221","v":0},111,"ALPHA REJOINER - Not used Logic Tree",null,null,null,null,null,null,null,null,{"$f":"D221&\"_\"&E221&\"_\"&F221&\"_\"&G221&\"_\"&H221&\"_\"&I221&\"_\"","v":"ALPHA REJOINER - Not used Logic Tree______"},{"$f":"SUMIF(Q221:AW221,\"Y\",$Q$100:$AH$100)","v":0},{"$f":"SUMIF(Q221:AW221,\"N\",$Q$100:$AH$100)","v":0}]
[28,0,112,null,null,null,null,null,null,null,null,null,"______",0,0]
[28,0,113,null,null,null,null,null,null,null,null,null,"______",0,0]
[28,0,114,null,null,null,null,null,null,null,null,null,"______",0,0]
[28,0,115,null,null,null,null,null,null,null,null,null,"______",0,0]
[28,0,116,null,null,null,null,null,null,null,null,null,"______",0,0]
[28,0,117,null,null,null,null,null,null,null,null,null,"______",0,0]
[28,0,118,null,null,null,null,null,null,null,null,null,"______",0,0]
[28,0,119,null,null,null,null,null,null,null,null,null,"______",0,0]
[28,0,120,null,null,null,null,null,null,null,null,null,"______",0,0]
[28,0,121,null,null,null,null,null,null,null,null,null,"______",0,0]
[28,0,122,null,null,null,null,null,null,null,null,null,"______",0,0]
[28,0,123,null,null,null,null,null,null,null,null,null,"______",0,0]
[]
[]
[]
[null,null,null,null,null,null,null,null,null,null,null,null,"Summary of Yes"]
[null,{"$f":"B110","v":"Unique ID"},{"$f":"C110","v":"Path Reference"},null,null,null,null,null,null,null,null,null,null,"Sum Yeses at each point",null,null,{"$f":"Q103","v":"Display"},"Has the member ever been a member of the Civil Service Pension arrangements?","Has the member ever been a member of the public service pension arrangements?","Was the member previously in the alpha scheme?","Was the member in either public or civil service on 1/4/2012?","Was the member MORE THAN 13.5 years to the public or civil pension service NPA @ 1/4/2012","Was the member LESS THAN 10 years to the public or civil pension service NPA @ 1/4/2012","As the member was in Civil Service at 31/3/2012 they should have taken part in the Options Exercise.  Did the member opt to move on their Taper Date (Y)?","Is the member fully protected?","Is the member's start date less than their Taper Date?",0,"Alpha rejoiner?","PCSPS rejoiner?","Did the member resign from their previous service?","Was the member dismissed due to inefficiency, end of fixed term contract or did their Fixed Term Appointment (FTA) end?","Did the take an approved early retirement (AER)?","Did the member take an age retirement? ","Did the member take an ill-health retirement? ","Did the member take an early retirement (ARR)? ","Did the member leave WITH early leaver reserved rights? ","Did the member leave WITHOUT early leaver reserved rights? ","Did the member have more than two years' qualifying service? ","Was the member's previous scheme classic? ","Was the member's previous scheme nuvos? ","Did the member receive a compensation payment? ","Did the member have pre-2010 CSCS terms? ","Does the member have a Civil Service pension in payment? ","Did the member re-join within 6 months? ","Did the member re-join within 5 years? ","Was the member's previous scheme partnership? ","Did the member retire on a lower tier ill health?",0,{"$f":"AW103","v":0}]
[null,"134242304Y4198400N",1,null,null,null,null,null,null,null,null,null,{"$f":"M111","v":"Scheme - alpha or partnership_alpha_alpha Paragraph E_Y___"},{"$f":"AH239","v":24576},null,{"$f":"N239&\"Y\"","v":"24576Y"},{"$f":"IF(Q111=\"Y\",Q$100,0)","v":0},{"$f":"IF(R111=\"Y\",R$100,0)+Q239","v":0},{"$f":"IF(S111=\"Y\",S$100,0)+R239","v":0},{"$f":"IF(T111=\"Y\",T$100,0)+S239","v":0},{"$f":"IF(U111=\"Y\",U$100,0)+T239","v":0},{"$f":"IF(V111=\"Y\",V$100,0)+U239","v":0},{"$f":"IF(W111=\"Y\",W$100,0)+V239","v":0},{"$f":"IF(X111=\"Y\",X$100,0)+W239","v":0},{"$f":"IF(Y111=\"Y\",Y$100,0)+X239","v":0},{"$f":"IF(Z111=\"Y\",Z$100,0)+Y239","v":0},{"$f":"IF(AA111=\"Y\",AA$100,0)+Z239","v":0},{"$f":"IF(AB111=\"Y\",AB$100,0)+AA239","v":0},{"$f":"IF(AC111=\"Y\",AC$100,0)+AB239","v":8192},{"$f":"IF(AD111=\"Y\",AD$100,0)+AC239","v":24576},{"$f":"IF(AE111=\"Y\",AE$100,0)+AD239","v":24576},{"$f":"IF(AF111=\"Y\",AF$100,0)+AE239","v":24576},{"$f":"IF(AG111=\"Y\",AG$100,0)+AF239","v":24576},{"$f":"IF(AH111=\"Y\",AH$100,0)+AG239","v":24576},{"$f":"IF(AI111=\"Y\",AI$100,0)+AH239","v":24576},{"$f":"IF(AJ111=\"Y\",AJ$100,0)+AI239","v":24576},{"$f":"IF(AK111=\"Y\",AK$100,0)+AJ239","v":24576},{"$f":"IF(AL111=\"Y\",AL$100,0)+AK239","v":24576},{"$f":"IF(AM111=\"Y\",AM$100,0)+AL239","v":24576},{"$f":"IF(AN111=\"Y\",AN$100,0)+AM239","v":24576},{"$f":"IF(AO111=\"Y\",AO$100,0)+AN239","v":24576},{"$f":"IF(AP111=\"Y\",AP$100,0)+AO239","v":24576},{"$f":"IF(AQ111=\"Y\",AQ$100,0)+AP239","v":134242304},{"$f":"IF(AR111=\"Y\",AR$100,0)+AQ239","v":134242304},{"$f":"IF(AS111=\"Y\",AS$100,0)+AR239","v":134242304},{"$f":"IF(AT111=\"Y\",AT$100,0)+AS239","v":134242304},{"$f":"IF(AU111=\"Y\",AU$100,0)+AT239","v":134242304},{"$f":"IF(AV111=\"Y\",AV$100,0)+AU239","v":134242304},{"$f":"IF(AW111=\"Y\",AW$100,0)+AV239","v":134242304}]
[null,"24576Y138416128N",{"$f":"C112","v":2},null,null,null,null,null,null,null,null,null,{"$f":"M112","v":"Scheme - alpha or partnership_alpha_alpha Paragraph A_ ___"},{"$f":"AH240","v":24576},null,{"$f":"N240&\"Y\"","v":"24576Y"},{"$f":"IF(Q112=\"Y\",Q$100,0)","v":0},{"$f":"IF(R112=\"Y\",R$100,0)+Q240","v":0},0,0,0,0,0,0,0,0,0,{"$f":"IF(AB112=\"Y\",AB$100,0)+AA240","v":0},8192,24576,24576,24576,24576,24576,24576,24576,24576,24576,24576,24576,24576,24576,24576,24576,24576,24576,24576,24576,24576]
[null,"155213824Y4096N",{"$f":"C113","v":3},null,null,null,null,null,null,null,null,null,"Scheme - alpha or partnership_alpha_alpha Paragraph E_Y___",24576,null,"24576Y",{"$f":"IF(Q113=\"Y\",Q$100,0)","v":0},{"$f":"IF(R113=\"Y\",R$100,0)+Q241","v":0},0,0,0,0,0,0,0,0,0,{"$f":"IF(AB113=\"Y\",AB$100,0)+AA241","v":0},8192,24576,24576,24576,24576,24576,24576,24576,24576,4218880,4218880,20996096,20996096,20996096,155213824,155213824,155213824,155213824,155213824,155213824,155213824]
[null,"20996096Y134221824N",{"$f":"C114","v":4},null,null,null,null,null,null,null,null,null,"Scheme - alpha or partnership_alpha_alpha Paragraph A____",24576,null,"24576Y",{"$f":"IF(Q114=\"Y\",Q$100,0)","v":0},{"$f":"IF(R114=\"Y\",R$100,0)+Q242","v":0},0,0,0,0,0,0,0,0,0,0,8192,24576,24576,24576,24576,24576,24576,24576,24576,4218880,4218880,20996096,20996096,20996096,20996096,20996096,20996096,20996096,20996096,20996096,20996096]
[null,"138436608Y16781312N",{"$f":"C115","v":5},null,null,null,null,null,null,null,null,null,"Scheme - alpha or partnership_alpha_alpha Paragraph E_Y___",24576,null,"24576Y",0,0,0,0,0,0,0,0,0,0,0,0,8192,24576,24576,24576,24576,24576,24576,24576,24576,4218880,4218880,4218880,4218880,4218880,138436608,138436608,138436608,138436608,138436608,138436608,138436608]
[null,"1614831616Y150999040N",{"$f":"C116","v":6},null,null,null,null,null,null,null,null,null,"Scheme - alpha or partnership_alpha_alpha Paragraph A____",24576,null,"24576Y",0,0,0,0,0,0,0,0,0,0,0,0,8192,24576,24576,24576,24576,24576,24576,24576,24576,4218880,4218880,4218880,4218880,4218880,4218880,4218880,541089792,1614831616,1614831616,1614831616,1614831616]
[null,"541089792Y1224740864N",{"$f":"C117","v":7},null,null,null,null,null,null,null,null,null,"Scheme - alpha or partnership_alpha_alpha Paragraph G____",24576,null,"24576Y",0,0,0,0,0,0,0,0,0,0,0,0,8192,24576,24576,24576,24576,24576,24576,24576,24576,4218880,4218880,4218880,4218880,4218880,4218880,4218880,541089792,541089792,541089792,541089792,541089792]
[null,"4218880Y687869952N",{"$f":"C118","v":8},null,null,null,null,null,null,null,null,null,"Scheme - alpha or partnership_alpha_alpha Paragraph A____",24576,null,"24576Y",0,0,{"$f":"IF(S118=\"Y\",S$100,0)+R246","v":0},0,0,0,0,0,0,0,0,0,8192,24576,24576,24576,24576,24576,24576,24576,24576,4218880,4218880,4218880,4218880,4218880,4218880,4218880,4218880,4218880,4218880,4218880,4218880]
[null,"453025792Y4214784N",{"$f":"C119","v":9},null,null,null,null,null,null,null,null,null,"Scheme - alpha or partnership_alpha_alpha Paragraph M_Y_Y - Check £100,000 compensation limit__",40960,null,"40960Y",0,0,0,0,0,0,0,0,0,0,0,0,8192,8192,40960,40960,40960,40960,40960,40960,40960,40960,40960,16818176,50372608,50372608,184590336,453025792,453025792,453025792,453025792,453025792,453025792]
[null,"184590336Y272650240N",{"$f":"C120","v":10},null,null,null,null,null,null,null,null,null,"Scheme - alpha or partnership_alpha_alpha Paragraph E_Y___",40960,null,"40960Y",0,0,0,0,0,0,0,0,0,0,0,0,8192,8192,40960,40960,40960,40960,40960,40960,40960,40960,40960,16818176,{"$f":"IF(AO120=\"Y\",AO$100,0)+AN248","v":50372608},50372608,184590336,184590336,184590336,184590336,184590336,184590336,184590336]
[null,"318808064Y138432512N",{"$f":"C121","v":11},null,null,null,null,null,null,null,null,null,"Scheme - alpha or partnership_alpha_alpha Paragraph M__Y - Check £100,000 compensation limit__",40960,null,"40960Y",0,0,0,0,0,0,0,0,0,0,0,0,8192,8192,40960,40960,40960,40960,40960,40960,40960,40960,40960,16818176,50372608,50372608,50372608,318808064,318808064,318808064,318808064,318808064,318808064]
[null,"50372608Y406867968N",{"$f":"C122","v":12},null,null,null,null,null,null,null,null,null,"Scheme - alpha or partnership_alpha_alpha Paragraph A____",40960,null,"40960Y",0,0,0,0,0,0,0,0,0,0,0,0,8192,8192,40960,40960,40960,40960,40960,40960,40960,40960,40960,16818176,50372608,50372608,50372608,50372608,50372608,50372608,50372608,50372608,50372608]
[null,"151035904Y37769216N",{"$f":"C123","v":13},null,null,null,null,null,null,null,null,null,"Scheme - alpha or partnership_alpha_alpha Paragraph E_Y___",40960,null,"40960Y",0,0,0,0,0,0,0,0,0,0,0,0,8192,8192,40960,40960,40960,40960,40960,40960,40960,40960,40960,16818176,16818176,16818176,151035904,151035904,151035904,151035904,151035904,151035904,151035904]
[null,"16818176Y171986944N",{"$f":"C124","v":14},null,null,null,null,null,null,null,null,null,"Scheme - alpha or partnership_alpha_alpha Paragraph A____",40960,null,"40960Y",0,0,0,0,0,0,0,0,0,{"$f":"IF(Z124=\"Y\",Z$100,0)+Y252","v":0},0,0,8192,8192,40960,40960,40960,40960,40960,40960,40960,40960,40960,16818176,16818176,16818176,16818176,16818176,16818176,16818176,16818176,16818176,16818176]
[null,"436248576Y20992000N",{"$f":"C125","v":15},null,null,null,null,null,null,null,null,null,"Scheme - alpha or partnership_alpha_alpha Paragraph M_Y_Y - Check £100,000 compensation limit__",40960,null,"40960Y",0,0,0,0,0,0,0,0,0,0,0,0,8192,8192,40960,40960,40960,40960,40960,40960,40960,40960,40960,40960,33595392,33595392,167813120,436248576,436248576,436248576,436248576,436248576,436248576]
[null,"704684032Y289427456N",{"$f":"C126","v":16},null,null,null,null,null,null,null,null,null,"Scheme - alpha or partnership_alpha_alpha Paragraph E_Y___",40960,null,"40960Y",0,0,0,0,0,0,0,0,0,0,0,0,8192,8192,40960,40960,40960,40960,40960,40960,40960,40960,40960,40960,33595392,33595392,167813120,167813120,704684032,704684032,704684032,704684032,704684032]
[null,"167813120Y826298368N",{"$f":"C127","v":17},null,null,null,null,null,null,null,null,null,"Scheme - alpha or partnership_alpha_alpha Paragraph E_Y___",40960,null,"40960Y",0,0,0,0,0,0,0,0,0,0,0,0,8192,8192,40960,40960,40960,40960,40960,40960,40960,40960,40960,40960,33595392,33595392,167813120,167813120,167813120,167813120,167813120,167813120,167813120]
[null,"302030848Y155209728N",{"$f":"C128","v":18},null,null,null,null,null,null,null,null,null,"Scheme - alpha or partnership_alpha_alpha Paragraph M____",40960,null,"40960Y",0,0,0,0,0,0,0,0,0,0,0,0,8192,8192,40960,40960,40960,40960,40960,40960,40960,40960,40960,40960,33595392,33595392,33595392,302030848,302030848,302030848,302030848,302030848,302030848]
[null,"1644208128Y423645184N",{"$f":"C129","v":19},null,null,null,null,null,null,null,null,null,"Scheme - alpha or partnership_alpha_alpha Paragraph A____",40960,null,"40960Y",0,0,0,0,0,0,0,0,0,0,0,0,8192,8192,40960,40960,40960,40960,40960,40960,40960,40960,40960,40960,33595392,33595392,33595392,33595392,570466304,1644208128,1644208128,1644208128,1644208128]
[null,"570466304Y1497387008N",{"$f":"C130","v":20},null,null,null,null,null,null,null,null,null,"Scheme - alpha or partnership_alpha_alpha Paragraph G____",40960,null,"40960Y",0,0,0,0,0,0,0,0,0,0,0,0,8192,8192,40960,40960,40960,40960,40960,40960,40960,40960,40960,40960,33595392,33595392,33595392,33595392,570466304,570466304,570466304,570466304,570466304]
[null,"33595392Y960516096N",{"$f":"C131","v":21},null,null,null,null,null,null,null,null,null,"Scheme - alpha or partnership_alpha_alpha Paragraph A____",40960,null,"40960Y",0,0,0,0,0,0,0,0,0,0,0,0,8192,8192,40960,40960,40960,40960,40960,40960,40960,40960,40960,40960,33595392,33595392,33595392,33595392,33595392,33595392,33595392,33595392,33595392]
[null,"134258688Y54546432N",{"$f":"C132","v":22},null,null,null,null,null,null,null,null,null,"Scheme - alpha or partnership_alpha_alpha Paragraph E_Y___",40960,null,"40960Y",0,0,0,0,0,0,0,0,0,0,0,0,8192,8192,40960,40960,40960,40960,40960,40960,40960,40960,40960,40960,40960,40960,134258688,134258688,134258688,134258688,134258688,134258688,134258688]
[null,"1610653696Y188764160N",{"$f":"C133","v":23},null,null,null,null,null,null,null,null,null,"Scheme - alpha or partnership_alpha_alpha Paragraph A____",40960,null,"40960Y",0,0,0,0,0,0,0,0,0,0,0,0,8192,8192,40960,40960,40960,40960,40960,40960,40960,40960,40960,40960,40960,40960,40960,40960,536911872,1610653696,1610653696,1610653696,1610653696]
[null,"536911872Y1262505984N",{"$f":"C134","v":24},null,null,null,null,null,null,null,null,null,"Scheme - alpha or partnership_alpha_alpha Paragraph A____",40960,null,"40960Y",0,0,0,0,0,0,0,0,0,0,0,0,8192,8192,40960,40960,40960,40960,40960,40960,40960,40960,40960,40960,40960,40960,40960,40960,536911872,536911872,536911872,536911872,536911872]
[null,"40960Y725635072N",{"$f":"C135","v":25},null,null,null,null,null,null,null,null,null,"Scheme - alpha or partnership_alpha_alpha Paragraph A____",40960,null,"40960Y",0,0,0,0,0,0,0,0,0,0,0,0,8192,8192,40960,40960,40960,40960,40960,40960,40960,40960,40960,40960,40960,40960,40960,40960,40960,40960,40960,40960,40960]
[null,"457220096Y20480N",{"$f":"C136","v":26},null,null,null,null,null,null,null,null,null,"Scheme - alpha or partnership_alpha_alpha Paragraph M_Y_Y - Check £100,000 compensation limit__",40960,null,"40960Y",0,0,{"$f":"IF(S136=\"Y\",S$100,0)+R264","v":0},0,0,0,0,0,0,0,0,0,8192,8192,40960,40960,40960,40960,40960,40960,40960,4235264,4235264,21012480,54566912,54566912,188784640,457220096,457220096,457220096,457220096,457220096,457220096]
[null,"188784640Y268455936N",{"$f":"C137","v":27},null,null,null,null,null,null,null,null,null,"Scheme - alpha or partnership_alpha_alpha Paragraph E_Y___",40960,null,"40960Y",0,0,0,0,0,0,0,0,0,0,0,0,8192,8192,40960,40960,40960,40960,40960,40960,40960,4235264,4235264,21012480,54566912,54566912,188784640,188784640,188784640,188784640,188784640,188784640,188784640]
[null,"323002368Y134238208N",{"$f":"C138","v":28},null,null,null,null,null,null,null,null,null,"Scheme - alpha or partnership_alpha_alpha Paragraph M__Y - Check £100,000 compensation limit__",40960,null,"40960Y",0,0,0,0,0,0,0,0,0,0,0,0,8192,8192,40960,40960,40960,40960,40960,40960,40960,4235264,4235264,21012480,54566912,54566912,54566912,323002368,323002368,323002368,323002368,323002368,323002368]
[null,"54566912Y402673664N",{"$f":"C139","v":29},null,null,null,null,null,null,null,null,null,"Scheme - alpha or partnership_alpha_alpha Paragraph A____",40960,null,"40960Y",0,0,0,0,0,0,0,0,0,0,0,0,8192,8192,40960,40960,40960,40960,40960,40960,40960,4235264,4235264,21012480,54566912,54566912,54566912,54566912,54566912,54566912,54566912,54566912,54566912]
[null,"155230208Y33574912N",{"$f":"C140","v":30},null,null,null,null,null,null,null,null,null,"Scheme - alpha or partnership_alpha_alpha Paragraph E_Y___",40960,null,"40960Y",0,0,0,0,0,0,0,0,0,0,0,0,8192,8192,40960,40960,40960,40960,40960,40960,40960,4235264,4235264,21012480,21012480,21012480,155230208,155230208,155230208,155230208,155230208,155230208,155230208]
[null,"21012480Y167792640N",{"$f":"C141","v":31},null,null,null,null,null,null,null,null,null,"Scheme - alpha or partnership_alpha_alpha Paragraph A____",40960,null,"40960Y",0,0,0,0,0,0,0,0,0,0,0,0,8192,8192,40960,40960,40960,40960,40960,40960,40960,4235264,4235264,21012480,21012480,21012480,21012480,21012480,21012480,21012480,21012480,21012480,21012480]
[null,"440442880Y16797696N",{"$f":"C142","v":32},null,null,null,null,null,null,null,null,null,"Scheme - alpha or partnership_alpha_alpha Paragraph M_Y_Y - Check £100,000 compensation limit__",40960,null,"40960Y",0,0,0,0,0,0,0,0,0,0,0,0,8192,8192,40960,40960,40960,40960,40960,40960,40960,4235264,4235264,4235264,37789696,37789696,172007424,440442880,440442880,440442880,440442880,440442880,440442880]
[null,{"$f":"B143","v":"708878336Y285233152N"},{"$f":"C143","v":33},null,null,null,null,null,null,null,null,null,"Scheme - alpha or partnership_alpha_alpha Paragraph E_Y___",40960,null,"40960Y",0,0,0,0,0,0,0,0,0,0,0,0,8192,8192,40960,40960,40960,40960,40960,40960,40960,4235264,4235264,4235264,37789696,37789696,172007424,172007424,708878336,708878336,708878336,708878336,708878336]
[null,"172007424Y822104064N",{"$f":"C144","v":34},null,null,null,null,null,null,null,null,null,"Scheme - alpha or partnership_alpha_alpha Paragraph E_Y___",40960,null,"40960Y",0,0,0,0,0,0,0,0,0,0,0,0,8192,8192,40960,40960,40960,40960,40960,40960,40960,4235264,4235264,4235264,37789696,37789696,172007424,172007424,172007424,172007424,172007424,172007424,172007424]
[null,"306225152Y151015424N",{"$f":"C145","v":35},null,null,null,null,null,null,null,null,null,"Scheme - alpha or partnership_alpha_alpha Paragraph M____",40960,null,"40960Y",0,0,0,0,0,0,0,0,0,0,0,0,8192,8192,40960,40960,40960,40960,40960,40960,40960,4235264,4235264,4235264,37789696,37789696,37789696,306225152,306225152,306225152,306225152,306225152,306225152]
[null,"1648402432Y419450880N",{"$f":"C146","v":36},null,null,null,null,null,null,null,null,null,"Scheme - alpha or partnership_alpha_alpha Paragraph M____",40960,null,"40960Y",0,0,0,0,0,0,0,0,0,0,0,0,8192,8192,40960,40960,40960,40960,40960,40960,40960,4235264,4235264,4235264,37789696,37789696,37789696,37789696,574660608,1648402432,1648402432,1648402432,1648402432]
[null,"574660608Y1493192704N",{"$f":"C147","v":37},null,null,null,null,null,null,null,null,null,"Scheme - alpha or partnership_alpha_alpha Paragraph G____",40960,null,"40960Y",0,0,0,0,0,0,0,0,0,0,0,0,8192,8192,40960,40960,40960,40960,40960,40960,40960,4235264,4235264,4235264,37789696,37789696,37789696,37789696,574660608,574660608,574660608,574660608,574660608]
[null,"37789696Y956321792N",{"$f":"C148","v":38},null,null,null,null,null,null,null,null,null,"Scheme - alpha or partnership_alpha_alpha Paragraph A____",40960,null,"40960Y",0,0,0,0,0,0,0,0,0,0,0,0,8192,8192,40960,40960,40960,40960,40960,40960,40960,4235264,4235264,4235264,37789696,37789696,37789696,37789696,37789696,37789696,37789696,37789696,37789696]
[null,"138452992Y50352128N",{"$f":"C149","v":39},null,null,null,null,null,null,null,null,null,"Scheme - alpha or partnership_alpha_alpha Paragraph E_Y___",40960,null,"40960Y",0,0,0,0,0,0,0,0,0,0,0,0,8192,8192,40960,40960,40960,40960,40960,40960,40960,4235264,4235264,4235264,4235264,4235264,138452992,138452992,138452992,138452992,138452992,138452992,138452992]
[null,"1614848000Y184569856N",{"$f":"C150","v":40},null,null,null,null,null,null,null,null,null,"Scheme - alpha or partnership_alpha_alpha Paragraph A____",40960,null,"40960Y",0,0,0,0,0,0,0,0,0,0,0,0,8192,8192,40960,40960,40960,40960,40960,40960,40960,4235264,4235264,4235264,4235264,4235264,4235264,4235264,541106176,1614848000,1614848000,1614848000,1614848000]
[null,"541106176Y1258311680N",{"$f":"C151","v":41},null,null,null,null,null,null,null,null,null,"Scheme - alpha or partnership_alpha_alpha Paragraph G____",40960,null,"40960Y",0,0,0,0,0,0,0,0,0,0,0,0,8192,8192,40960,40960,40960,40960,40960,40960,40960,4235264,4235264,4235264,4235264,4235264,4235264,4235264,541106176,541106176,541106176,541106176,541106176]
[null,"4235264Y721440768N",{"$f":"C152","v":42},null,null,null,null,null,null,null,null,null,"Scheme - alpha or partnership_alpha_alpha Paragraph G____",40960,null,"40960Y",0,0,0,0,0,0,0,0,0,0,0,0,8192,8192,40960,40960,40960,40960,40960,40960,40960,4235264,4235264,4235264,4235264,4235264,4235264,4235264,4235264,4235264,4235264,4235264,4235264]
[null,"73728Y53248N",{"$f":"C153","v":43},null,null,null,null,null,null,null,null,null,"Scheme - alpha or partnership_alpha_alpha Paragraph E_Y___",73728,null,"73728Y",0,0,0,0,0,0,0,0,0,0,0,0,8192,8192,8192,73728,73728,73728,73728,73728,73728,73728,73728,73728,73728,73728,73728,73728,73728,73728,73728,73728,73728]
[null,"139264Y118784N",{"$f":"C154","v":44},null,null,null,null,null,null,null,null,null,"Scheme - alpha or partnership_alpha_alpha Paragraph E_Y___",139264,null,"139264Y",0,0,0,0,0,0,0,0,0,0,0,0,8192,8192,8192,8192,139264,139264,139264,139264,139264,139264,139264,139264,139264,139264,139264,139264,139264,139264,139264,139264,139264]
[null,"8658944Y249856N",{"$f":"C155","v":45},null,null,null,null,null,null,null,null,null,"Scheme - alpha or partnership_alpha_alpha Paragraph F_Y___",270336,null,"270336Y",0,0,0,0,0,0,0,0,0,0,0,0,8192,8192,8192,8192,8192,270336,270336,270336,270336,270336,8658944,8658944,8658944,8658944,8658944,8658944,8658944,8658944,8658944,8658944,8658944]
[null,"2147753984Y8638464N",{"$f":"C156","v":46},null,null,null,null,null,null,null,null,null,"Scheme - alpha or partnership_alpha_alpha Paragraph F_Y___",270336,null,"270336Y",0,0,0,0,0,0,0,0,0,0,0,0,8192,8192,8192,8192,8192,270336,270336,270336,270336,270336,270336,270336,270336,270336,270336,270336,270336,270336,2147753984,2147753984,2147753984]
[null,"270336Y2156122112N",{"$f":"C157","v":47},null,null,null,null,null,null,null,null,null,"Not eligible, Ill health assesment required refer to MyCSP______",270336,null,"270336Y",0,0,0,0,0,0,0,0,0,0,0,0,8192,8192,8192,8192,8192,270336,270336,270336,270336,270336,270336,270336,270336,270336,270336,270336,270336,270336,270336,270336,270336]
[null,"532480Y512000N",{"$f":"C158","v":48},null,null,null,null,null,null,null,null,null,"Scheme - alpha or partnership_alpha_alpha Paragraph E_Y___",8192,null,"8192Y",0,0,0,0,0,0,0,0,0,0,0,0,8192,8192,8192,8192,8192,8192,532480,532480,532480,532480,532480,532480,532480,532480,532480,532480,532480,532480,532480,532480,532480]
[null,"202383360Y1036288N",{"$f":"C159","v":49},null,null,null,null,null,null,null,null,null,"Scheme - alpha or partnership_alpha_alpha Paragraph E_Y_Y - Check £100,000 compensation limit_Y_",8192,null,"8192Y",0,0,0,0,0,0,0,0,0,0,0,0,8192,8192,8192,8192,8192,8192,8192,1056768,1056768,1056768,1056768,1056768,1056768,68165632,202383360,202383360,202383360,202383360,202383360,202383360,202383360]
[null,"68165632Y135254016N",{"$f":"C160","v":50},null,null,null,null,null,null,null,null,null,"Scheme - alpha or partnership_alpha_alpha Paragraph A__Check £100,000 compensation limit_Y_",8192,null,"8192Y",0,0,0,0,0,0,0,0,0,0,0,0,8192,8192,8192,8192,8192,8192,8192,1056768,1056768,1056768,1056768,1056768,1056768,68165632,68165632,68165632,68165632,68165632,68165632,68165632,68165632]
[null,"403709952Y68145152N",{"$f":"C161","v":51},null,null,null,null,null,null,null,null,null,"Scheme - alpha or partnership_alpha_alpha Paragraph M_Y_Y - Check £100,000 compensation limit_Y_",8192,null,"8192Y",0,0,0,0,0,0,0,0,0,0,0,0,8192,8192,8192,8192,8192,8192,8192,1056768,1056768,1056768,1056768,1056768,1056768,1056768,135274496,403709952,403709952,403709952,403709952,403709952,403709952]
[null,"135274496Y336580608N",{"$f":"C162","v":52},null,null,null,null,null,null,null,null,null,"Scheme - alpha or partnership_alpha_alpha Paragraph E_Y_ Check £100,000 compensation limit_Y_",8192,null,"8192Y",0,0,0,0,0,0,0,0,0,0,0,0,8192,8192,8192,8192,8192,8192,8192,1056768,1056768,1056768,1056768,1056768,1056768,1056768,135274496,135274496,135274496,135274496,135274496,135274496,135274496]
[null,"269492224Y202362880N",{"$f":"C163","v":53},null,null,null,null,null,null,null,null,null,"Scheme - alpha or partnership_alpha_alpha Paragraph M__Y - Check £100,000 compensation limit_Y_",8192,null,"8192Y",0,0,0,0,0,0,0,0,0,0,0,0,8192,8192,8192,8192,8192,8192,8192,1056768,1056768,1056768,1056768,1056768,1056768,1056768,1056768,269492224,269492224,269492224,269492224,269492224,269492224]
[null,"1056768Y470798336N",{"$f":"C164","v":54},null,null,null,null,null,null,null,null,null,"Scheme - alpha or partnership_alpha_alpha Paragraph A__Check £100,000 compensation limit_Y_",8192,null,"8192Y",0,0,0,0,0,0,0,0,0,0,0,0,8192,8192,8192,8192,8192,8192,8192,1056768,1056768,1056768,1056768,1056768,1056768,1056768,1056768,1056768,1056768,1056768,1056768,1056768,1056768]
[null,"203431936Y2084864N",{"$f":"C165","v":55},null,null,null,null,null,null,null,null,null,"Scheme - alpha or partnership_alpha_alpha Paragraph M_Y_Y - Check £100,000 compensation limit__",8192,null,"8192Y",0,0,0,0,0,0,0,0,0,0,0,0,8192,8192,8192,8192,8192,8192,8192,8192,2105344,2105344,2105344,2105344,2105344,69214208,203431936,203431936,203431936,203431936,203431936,203431936,203431936]
[null,"69214208Y136302592N",{"$f":"C166","v":56},null,null,null,null,null,null,null,null,null,"Scheme - alpha or partnership_alpha_alpha Paragraph A__Check £100,000 compensation limit__",8192,null,"8192Y",0,0,0,0,0,0,0,0,0,0,0,0,8192,8192,8192,8192,8192,8192,8192,8192,2105344,2105344,2105344,2105344,2105344,69214208,69214208,69214208,69214208,69214208,69214208,69214208,69214208]
[null,"404758528Y69193728N",{"$f":"C167","v":57},null,null,null,null,null,null,null,null,null,"Scheme - alpha or partnership_alpha_alpha Paragraph M_Y_Y - Check £100,000 compensation limit__",8192,null,"8192Y",0,0,0,0,0,0,0,0,0,0,0,0,8192,8192,8192,8192,8192,8192,8192,8192,2105344,2105344,2105344,2105344,2105344,2105344,136323072,404758528,404758528,404758528,404758528,404758528,404758528]
[null,"136323072Y337629184N",{"$f":"C168","v":58},null,null,null,null,null,null,null,null,null,"Scheme - alpha or partnership_alpha_alpha Paragraph E_Y_Check £100,000 compensation limit__",8192,null,"8192Y",0,0,0,0,0,0,0,0,0,0,0,0,8192,8192,8192,8192,8192,8192,8192,8192,2105344,2105344,2105344,2105344,2105344,2105344,136323072,136323072,136323072,136323072,136323072,136323072,136323072]
[null,"270540800Y203411456N",{"$f":"C169","v":59},null,null,null,null,null,null,null,null,null,"Scheme - alpha or partnership_alpha_alpha Paragraph M__Y - Check £100,000 compensation limit__",8192,null,"8192Y",0,0,0,0,0,0,0,0,0,0,0,0,8192,8192,8192,8192,8192,8192,8192,8192,2105344,2105344,2105344,2105344,2105344,2105344,2105344,270540800,270540800,270540800,270540800,270540800,270540800]
[null,"2105344Y471846912N",{"$f":"C170","v":60},null,null,null,null,null,null,null,null,null,"Scheme - alpha or partnership_alpha_alpha Paragraph A____",8192,null,"8192Y",0,0,0,0,0,0,0,0,0,0,0,0,8192,8192,8192,8192,8192,8192,8192,8192,2105344,2105344,2105344,2105344,2105344,2105344,2105344,2105344,2105344,2105344,2105344,2105344,2105344]
[null,0,{"$f":"C171","v":0},null,null,null,null,null,null,null,null,null,{"$error":"#REF!"},0,null,"0Y",0,0,0,0,0,0,0,0,0,0,0,0,0,0,0,0,0,0,0,0,0,0,0,0,0,0,0,0,0,0,0,0,0]
[null,0,{"$f":"C172","v":0},null,null,null,null,null,null,null,null,null,"Not Found Carry On_Not Found Carry On_____",0,null,"0Y",0,0,0,0,0,0,0,0,0,0,0,0,0,0,0,0,0,0,0,0,0,0,0,0,0,0,0,0,0,0,0,0,0]
[null,0,{"$f":"C173","v":0},null,null,null,null,null,null,null,null,null,"Not Found Carry On______",0,null,"0Y",0,0,0,0,0,0,0,0,0,0,0,0,0,0,0,0,0,0,0,0,0,0,0,0,0,0,0,0,0,0,0,0,0]
[null,0,{"$f":"C174","v":0},null,null,null,null,null,null,null,null,null,"Not Found Carry On______",0,null,"0Y",0,0,0,0,0,0,0,0,0,0,0,0,0,0,0,0,0,0,0,0,0,0,0,0,0,0,0,0,0,0,0,0,0]
[null,{"$f":"B175","v":0},{"$f":"C175","v":0},null,null,null,null,null,null,null,null,null,"Not Found Carry On______",0,null,"0Y",0,0,{"$f":"IF(S175=\"Y\",S$100,0)+R303","v":0},{"$f":"IF(T175=\"Y\",T$100,0)+S303","v":0},{"$f":"IF(U175=\"Y\",U$100,0)+T303","v":0},{"$f":"IF(V175=\"Y\",V$100,0)+U303","v":0},{"$f":"IF(W175=\"Y\",W$100,0)+V303","v":0},{"$f":"IF(X175=\"Y\",X$100,0)+W303","v":0},{"$f":"IF(Y175=\"Y\",Y$100,0)+X303","v":0},{"$f":"IF(Z175=\"Y\",Z$100,0)+Y303","v":0},{"$f":"IF(AA175=\"Y\",AA$100,0)+Z303","v":0},{"$f":"IF(AB175=\"Y\",AB$100,0)+AA303","v":0},{"$f":"IF(AC175=\"Y\",AC$100,0)+AB303","v":0},{"$f":"IF(AD175=\"Y\",AD$100,0)+AC303","v":0},{"$f":"IF(AE175=\"Y\",AE$100,0)+AD303","v":0},{"$f":"IF(AF175=\"Y\",AF$100,0)+AE303","v":0},{"$f":"IF(AG175=\"Y\",AG$100,0)+AF303","v":0},{"$f":"IF(AH175=\"Y\",AH$100,0)+AG303","v":0},{"$f":"IF(AI175=\"Y\",AI$100,0)+AH303","v":0},{"$f":"IF(AJ175=\"Y\",AJ$100,0)+AI303","v":0},{"$f":"IF(AK175=\"Y\",AK$100,0)+AJ303","v":0},{"$f":"IF(AL175=\"Y\",AL$100,0)+AK303","v":0},{"$f":"IF(AM175=\"Y\",AM$100,0)+AL303","v":0},{"$f":"IF(AN175=\"Y\",AN$100,0)+AM303","v":0},{"$f":"IF(AO175=\"Y\",AO$100,0)+AN303","v":0},{"$f":"IF(AP175=\"Y\",AP$100,0)+AO303","v":0},{"$f":"IF(AQ175=\"Y\",AQ$100,0)+AP303","v":0},{"$f":"IF(AR175=\"Y\",AR$100,0)+AQ303","v":0},{"$f":"IF(AS175=\"Y\",AS$100,0)+AR303","v":0},{"$f":"IF(AT175=\"Y\",AT$100,0)+AS303","v":0},{"$f":"IF(AU175=\"Y\",AU$100,0)+AT303","v":0},{"$f":"IF(AV175=\"Y\",AV$100,0)+AU303","v":0},{"$f":"IF(AW175=\"Y\",AW$100,0)+AV303","v":0}]
[null,0,{"$f":"C176","v":0},null,null,null,null,null,null,null,null,null,{"$f":"M176","v":"Not Found Carry On______"},{"$f":"AH304","v":0},null,{"$f":"N304&\"Y\"","v":"0Y"},0,0,0,0,0,0,0,0,0,0,0,0,0,0,0,0,0,0,0,0,0,0,0,0,0,0,0,0,0,0,0,0,0]
[null,0,{"$f":"C177","v":0},null,null,null,null,null,null,null,null,null,"Not Found Carry On______",0,null,"0Y",0,0,0,0,0,0,0,0,0,0,0,0,0,0,0,0,0,0,0,0,0,0,0,0,0,0,0,0,0,0,0,0,0]
[null,"69632Y57344N",{"$f":"C178","v":68},null,null,null,null,null,null,null,null,null,"Scheme - alpha or partnership_alpha_alpha Paragraph E_Y___",69632,null,"69632Y",{"$f":"IF(Q178=\"Y\",Q$100,0)","v":0},{"$f":"IF(R178=\"Y\",R$100,0)+Q306","v":0},0,0,0,0,0,0,0,0,0,4096,4096,4096,4096,69632,69632,69632,69632,69632,69632,69632,69632,69632,69632,69632,69632,69632,69632,69632,69632,69632,69632]
[null,"135168Y122880N",{"$f":"C179","v":69},null,null,null,null,null,null,null,null,null,"Scheme - alpha or partnership_alpha_alpha Paragraph E_Y___",135168,null,"135168Y",0,0,0,0,0,0,0,0,0,0,0,4096,4096,4096,4096,4096,135168,135168,135168,135168,135168,135168,135168,135168,135168,135168,135168,135168,135168,135168,135168,135168,135168]
[null,"2147749888Y253952N",{"$f":"C180","v":70},null,null,null,null,null,null,null,null,null,"Scheme - alpha or partnership_alpha_alpha Paragraph F_Y___",266240,null,"266240Y",0,0,0,0,0,0,0,0,0,0,0,4096,4096,4096,4096,4096,4096,266240,266240,266240,266240,266240,266240,266240,266240,266240,266240,266240,266240,266240,2147749888,2147749888,2147749888]
[null,"266240Y2147737600N",{"$f":"C181","v":71},null,null,null,null,null,null,null,null,null,"Not Eligibile__alpha Paragraph ____",266240,null,"266240Y",0,0,0,0,0,{"$f":"IF(V181=\"Y\",V$100,0)+U309","v":0},0,0,0,0,0,4096,4096,4096,4096,4096,4096,266240,266240,266240,266240,266240,266240,266240,266240,266240,266240,266240,266240,266240,266240,266240,266240]
[null,"528384Y516096N",{"$f":"C182","v":72},null,null,null,null,null,null,null,null,null,"Scheme - alpha or partnership_alpha_alpha Paragraph E_Y___",4096,null,"4096Y",0,0,0,0,0,{"$f":"IF(V182=\"Y\",V$100,0)+U310","v":0},0,0,0,0,0,4096,4096,4096,4096,4096,4096,4096,528384,528384,528384,528384,528384,528384,528384,528384,528384,528384,528384,528384,528384,528384,528384]
[null,"134238208Y8192N",{"$f":"C183","v":73},null,null,null,null,null,null,null,null,null,"Scheme - alpha or partnership_alpha_alpha Paragraph E_Y___",20480,null,"20480Y",{"$f":"IF(Q183=\"Y\",Q$100,0)","v":0},0,0,0,0,0,0,0,0,0,0,4096,4096,20480,20480,20480,20480,20480,20480,20480,20480,20480,20480,20480,20480,20480,134238208,134238208,134238208,134238208,134238208,134238208,134238208]
[null,"20480Y134225920N",{"$f":"C184","v":74},null,null,null,null,null,null,null,null,null,"Scheme - alpha or partnership_alpha_alpha Paragraph A____",20480,null,"20480Y",{"$f":"IF(Q184=\"Y\",Q$100,0)","v":0},0,0,0,0,0,0,0,0,0,0,4096,4096,20480,20480,20480,20480,20480,20480,20480,20480,20480,20480,20480,20480,20480,20480,20480,20480,20480,20480,20480,20480]
[null,"436244480Y24576N",{"$f":"C185","v":75},null,null,null,null,null,null,null,null,null,"Scheme - alpha or partnership_alpha_alpha Paragraph M_Y_Y - Check £100,000 compensation limit__",36864,null,"36864Y",0,0,0,0,0,0,0,0,0,0,0,4096,4096,4096,36864,36864,36864,36864,36864,36864,36864,36864,36864,36864,33591296,33591296,167809024,436244480,436244480,436244480,436244480,436244480,436244480]
[null,"167809024Y268460032N",{"$f":"C186","v":76},null,null,null,null,null,null,null,null,null,"Scheme - alpha or partnership_alpha_alpha Paragraph E_Y___",36864,null,"36864Y",0,0,0,0,0,0,0,0,0,0,0,4096,4096,4096,36864,36864,36864,36864,36864,36864,36864,36864,36864,36864,33591296,33591296,167809024,167809024,167809024,167809024,167809024,167809024,167809024]
[null,"302026752Y134242304N",{"$f":"C187","v":77},null,null,null,null,null,null,null,null,null,"Scheme - alpha or partnership_alpha_alpha Paragraph M__Y - Check £100,000 compensation limit__",36864,null,"36864Y",0,0,0,0,0,0,0,0,0,0,0,4096,4096,4096,36864,36864,36864,36864,36864,36864,36864,36864,36864,36864,33591296,33591296,33591296,302026752,302026752,302026752,302026752,302026752,302026752]
[null,"33591296Y402677760N",{"$f":"C188","v":78},null,null,null,null,null,null,null,null,null,"Scheme - alpha or partnership_alpha_alpha Paragraph A____",36864,null,"36864Y",0,0,0,0,0,0,0,0,0,0,0,4096,4096,4096,36864,36864,36864,36864,36864,36864,36864,36864,36864,36864,33591296,33591296,33591296,33591296,33591296,33591296,33591296,33591296,33591296]
[null,"134254592Y33579008N",{"$f":"C189","v":79},null,null,null,null,null,null,null,null,null,"Scheme - alpha or partnership_alpha_alpha Paragraph E_Y___",36864,null,"36864Y",0,0,0,0,0,0,0,0,0,0,0,4096,4096,4096,36864,36864,36864,36864,36864,36864,36864,36864,36864,36864,36864,36864,134254592,134254592,134254592,134254592,134254592,134254592,134254592]
[null,"36864Y167796736N",{"$f":"C190","v":80},null,null,null,null,null,null,null,null,null,"Scheme - alpha or partnership_alpha_alpha Paragraph A____",36864,null,"36864Y",0,0,0,0,0,0,0,0,0,0,0,4096,4096,4096,36864,36864,36864,36864,36864,36864,36864,36864,36864,36864,36864,36864,36864,36864,36864,36864,36864,36864,36864]
[null,"202379264Y1040384N",{"$f":"C191","v":81},null,null,null,null,null,null,null,null,null,"Scheme - alpha or partnership_alpha_alpha Paragraph E_Y_Y - Check £100,000 compensation limit_Y_",4096,null,"4096Y",0,0,0,0,0,0,0,0,0,0,0,4096,4096,4096,4096,4096,4096,4096,4096,1052672,1052672,1052672,1052672,1052672,1052672,68161536,202379264,202379264,202379264,202379264,202379264,202379264,202379264]
[null,"68161536Y135258112N",{"$f":"C192","v":82},null,null,null,null,null,null,null,null,null,"Scheme - alpha or partnership_alpha_alpha Paragraph A__Y - Check £100,000 compensation limit_Y_",4096,null,"4096Y",0,0,0,0,0,0,0,0,0,0,0,4096,4096,4096,4096,4096,4096,4096,4096,1052672,1052672,1052672,1052672,1052672,1052672,68161536,68161536,68161536,68161536,68161536,68161536,68161536,68161536]
[null,"403705856Y68149248N",{"$f":"C193","v":83},null,null,null,null,null,null,null,null,null,"Scheme - alpha or partnership_alpha_alpha Paragraph M_Y_Y - Check £100,000 compensation limit_Y_",4096,null,"4096Y",0,0,0,0,0,0,0,0,0,0,0,4096,4096,4096,4096,4096,4096,4096,4096,1052672,1052672,1052672,1052672,1052672,1052672,1052672,135270400,403705856,403705856,403705856,403705856,403705856,403705856]
[null,"135270400Y336584704N",{"$f":"C194","v":84},null,null,null,null,null,null,null,null,null,"Scheme - alpha or partnership_alpha_alpha Paragraph E_Y_Y - Check £100,000 compensation limit_Y_",4096,null,"4096Y",0,0,0,0,0,0,0,0,0,0,0,4096,4096,4096,4096,4096,4096,4096,4096,1052672,1052672,1052672,1052672,1052672,1052672,1052672,135270400,135270400,135270400,135270400,135270400,135270400,135270400]
[null,"269488128Y202366976N",{"$f":"C195","v":85},null,null,null,null,null,null,null,null,null,"Scheme - alpha or partnership_alpha_alpha Paragraph M__Y - Check £100,000 compensation limit_Y_",4096,null,"4096Y",0,0,0,0,0,0,0,0,0,0,0,4096,4096,4096,4096,4096,4096,4096,4096,1052672,1052672,1052672,1052672,1052672,1052672,1052672,1052672,269488128,269488128,269488128,269488128,269488128,269488128]
[null,"1052672Y470802432N",{"$f":"C196","v":86},null,null,null,null,null,null,null,null,null,"Scheme - alpha or partnership_alpha_alpha Paragraph A__Y - Check £100,000 compensation limit_Y_",4096,null,"4096Y",0,0,0,0,0,0,0,0,0,0,0,4096,4096,4096,4096,4096,4096,4096,4096,1052672,1052672,1052672,1052672,1052672,1052672,1052672,1052672,1052672,1052672,1052672,1052672,1052672,1052672]
[null,"69210112Y2088960N",{"$f":"C197","v":87},null,null,null,null,null,null,null,null,null,"Scheme - alpha or partnership_alpha_alpha Paragraph E_Y_Y - Check £100,000 compensation limit_Y_",4096,null,"4096Y",0,0,0,0,0,0,0,0,0,0,0,4096,4096,4096,4096,4096,4096,4096,4096,4096,2101248,2101248,2101248,2101248,2101248,69210112,69210112,69210112,69210112,69210112,69210112,69210112,69210112]
[null,"2101248Y69197824N",{"$f":"C198","v":88},null,null,null,null,null,null,null,null,null,"Scheme - alpha or partnership_alpha_alpha Paragraph A__Y - Check £100,000 compensation limit__",4096,null,"4096Y",0,0,0,0,0,0,0,0,0,0,0,4096,4096,4096,4096,4096,4096,4096,4096,4096,2101248,2101248,2101248,2101248,2101248,2101248,2101248,2101248,2101248,2101248,2101248,2101248,2101248]
[null,"404754432Y69197824N",{"$f":"C199","v":89},null,null,null,null,null,null,null,null,null,"Scheme - alpha or partnership_alpha_alpha Paragraph M_Y_Y - Check £100,000 compensation limit__",4096,null,"4096Y",0,0,0,0,0,0,0,0,0,0,0,4096,4096,4096,4096,4096,4096,4096,4096,4096,2101248,2101248,2101248,2101248,2101248,2101248,136318976,404754432,404754432,404754432,404754432,404754432,404754432]
[null,"136318976Y337633280N",{"$f":"C200","v":90},null,null,null,null,null,null,null,null,null,"Scheme - alpha or partnership_alpha_alpha Paragraph E_Y_.__",4096,null,"4096Y",0,0,0,0,0,0,0,0,0,0,0,4096,4096,4096,4096,4096,4096,4096,4096,4096,2101248,2101248,2101248,2101248,2101248,2101248,136318976,136318976,136318976,136318976,136318976,136318976,136318976]
[null,"270536704Y203415552N",{"$f":"C201","v":91},null,null,null,null,null,null,null,null,null,"Scheme - alpha or partnership_alpha_alpha Paragraph M__Y - Check £100,000 compensation limit__",4096,null,"4096Y",0,0,0,0,0,0,0,0,0,0,0,4096,4096,4096,4096,4096,4096,4096,4096,4096,2101248,2101248,2101248,2101248,2101248,2101248,2101248,270536704,270536704,270536704,270536704,270536704,270536704]
[null,"2101248Y471851008N",{"$f":"C202","v":92},null,null,null,null,null,null,null,null,null,"Scheme - alpha or partnership_alpha_alpha Paragraph A____",4096,null,"4096Y",0,0,0,0,0,0,0,0,0,0,0,4096,4096,4096,4096,4096,4096,4096,4096,4096,2101248,2101248,2101248,2101248,2101248,2101248,2101248,2101248,2101248,2101248,2101248,2101248,2101248]
[null,0,{"$f":"C203","v":93},null,null,null,null,null,null,null,null,null,"ALPHA REJOINER - Not used Logic Tree______",0,null,"0Y",0,0,0,0,0,0,0,0,0,0,0,0,0,0,0,0,0,0,0,0,0,0,0,0,0,0,0,0,0,0,0,0,0]
[null,0,{"$f":"C204","v":94},null,null,null,null,null,null,null,null,null,"PCSPS REJOINER - Not used Logic Tree______",0,null,"0Y",0,0,0,0,0,0,0,0,0,0,0,0,0,0,0,0,0,0,0,0,0,0,0,0,0,0,0,0,0,0,0,0,0]
[null,0,{"$f":"C205","v":95},null,null,null,null,null,null,null,null,null,"ALPHA REJOINER - Not used Logic Tree______",0,null,"0Y",0,0,0,0,0,0,0,0,0,0,0,0,0,0,0,0,0,0,0,0,0,0,0,0,0,0,0,0,0,0,0,0,0]
[null,0,{"$f":"C206","v":96},null,null,null,null,null,null,null,null,null,"PCSPS REJOINER - Not used Logic Tree______",0,null,"0Y",0,0,0,0,0,0,0,0,0,0,0,0,0,0,0,0,0,0,0,0,0,0,0,0,0,0,0,0,0,0,0,0,0]
[null,{"$f":"B207","v":0},{"$f":"C207","v":97},null,null,null,null,null,null,null,null,null,"ALPHA REJOINER - Not used Logic Tree______",0,null,"0Y",0,0,0,0,0,0,0,0,0,0,0,0,0,0,0,0,0,0,0,0,0,0,0,0,0,0,0,0,0,0,0,0,0]
[null,0,{"$f":"C208","v":98},null,null,null,null,null,null,null,null,null,"ALPHA REJOINER - Not used Logic Tree______",0,null,"0Y",0,0,0,0,0,0,0,0,0,0,0,0,0,0,0,0,0,0,0,0,0,0,0,0,0,0,0,0,0,0,0,0,0]
[null,0,{"$f":"C209","v":99},null,null,null,null,null,null,null,null,null,"ALPHA REJOINER - Not used Logic Tree______",0,null,"0Y",0,0,0,0,0,0,0,0,0,0,0,0,0,0,0,0,0,0,0,0,0,0,0,0,0,0,0,0,0,0,0,0,0]
[null,"4Y12592N",{"$f":"C210","v":100},null,null,null,null,null,null,null,null,null,"alpha_alpha Paragraph A_____",4,null,"4Y",0,4,4,4,4,4,4,4,4,4,4,4,4,4,4,4,4,4,4,4,4,4,4,4,4,4,4,4,4,4,4,4,4]
[null,"8Y12596N",{"$f":"C211","v":101},null,null,null,null,null,null,null,null,null,"Scheme - alpha or partnership_alpha_alpha Paragraph A____",8,null,"8Y",0,0,8,8,8,8,8,8,8,8,8,8,8,8,8,8,8,8,8,8,8,8,8,8,8,8,8,8,8,8,8,8,8]
[null,"744Y12564N",{"$f":"C212","v":61},null,null,null,null,null,null,null,null,null,"Scheme - alpha or partnership_alpha_alpha Paragraph A____",744,null,"744Y",0,0,8,8,40,104,232,232,744,744,744,744,744,744,744,744,744,744,744,744,744,744,744,744,744,744,744,744,744,744,744,744,744]
[null,"232Y13076N",{"$f":"C213","v":62},null,null,null,null,null,null,null,null,null,"Scheme - alpha or partnership_alpha_alpha Paragraph A____",232,null,"232Y",0,0,8,8,40,104,232,232,232,232,232,232,232,232,232,232,232,232,232,232,232,232,232,232,232,232,232,232,232,232,232,232,232]
[null,"1128Y13204N",{"$f":"C214","v":63},null,null,null,null,null,null,null,null,null,"Scheme - alpha or partnership_alpha_alpha Paragraph A____",1128,null,"1128Y",0,0,8,8,40,104,104,104,104,1128,1128,1128,1128,1128,1128,1128,1128,1128,1128,1128,1128,1128,1128,1128,1128,1128,1128,1128,1128,1128,1128,1128,1128]
[null,"104Y14228N",{"$f":"C215","v":64},null,null,null,null,null,null,null,null,null,"Scheme - alpha or partnership_alpha_alpha Paragraph A____",104,null,"104Y",0,0,8,8,40,104,104,104,104,104,104,104,104,104,104,104,104,104,104,104,104,104,104,104,104,104,104,104,104,104,104,104,104]
[null,"1128Y12692N",{"$f":"C216","v":65},null,null,null,null,null,null,null,null,null,"Scheme - alpha or partnership_alpha_alpha Paragraph A____",1128,null,"1128Y",0,0,8,8,40,104,104,104,104,1128,1128,1128,1128,1128,1128,1128,1128,1128,1128,1128,1128,1128,1128,1128,1128,1128,1128,1128,1128,1128,1128,1128,1128]
[null,"40Y12628N",{"$f":"C217","v":66},null,null,null,null,null,null,null,null,null,"Scheme - alpha or partnership_alpha_alpha Paragraph A____",40,null,"40Y",0,0,8,8,40,40,40,40,40,40,40,40,40,40,40,40,40,40,40,40,40,40,40,40,40,40,40,40,40,40,40,40,40]
[null,"0Y12572N",{"$f":"C218","v":67},null,null,null,null,null,null,null,null,null,"Scheme - alpha or partnership_alpha_alpha Paragraph A____",0,null,"0Y",0,0,0,0,0,0,0,0,0,0,0,0,0,0,0,0,0,0,0,0,0,0,0,0,0,0,0,0,0,0,0,0,0]
[null,0,{"$f":"C219","v":102},null,null,null,null,null,null,null,null,null,"alpha_alpha Paragraph A_____",0,null,"0Y",0,0,0,0,0,0,0,0,0,0,0,0,0,0,0,0,0,0,0,0,0,0,0,0,0,0,0,0,0,0,0,0,0]
[null,0,{"$f":"C220","v":110},null,null,null,null,null,null,null,null,null,"______",0,null,"0Y",0,0,0,0,0,0,0,0,0,0,0,0,0,0,0,0,0,0,0,0,0,0,0,0,0,0,0,0,0,0,0,0,0]
[null,0,{"$f":"C221","v":111},null,null,null,null,null,null,null,null,null,"ALPHA REJOINER - Not used Logic Tree______",0,null,"0Y",0,0,0,0,0,0,0,0,0,0,0,0,0,0,0,0,0,0,0,0,0,0,0,0,0,0,0,0,0,0,0,0,0]
[null,0,{"$f":"C222","v":112},null,null,null,null,null,null,null,null,null,"______",0,null,"0Y",0,0,0,0,0,0,0,0,0,0,0,0,0,0,0,0,0,0,0,0,0,0,0,0,0,0,0,0,0,0,0,0,0]
[null,0,{"$f":"C223","v":113},null,null,null,null,null,null,null,null,null,"______",0,null,"0Y",0,0,0,0,0,0,0,0,0,0,0,0,0,0,0,0,0,0,0,0,0,0,0,0,0,0,0,0,0,0,0,0,0]
[null,0,{"$f":"C224","v":114},null,null,null,null,null,null,null,null,null,"______",0,null,"0Y",0,0,0,0,0,0,0,0,0,0,0,0,0,0,0,0,0,0,0,0,0,0,0,0,0,0,0,0,0,0,0,0,0]
[null,0,{"$f":"C225","v":115},null,null,null,null,null,null,null,null,null,"______",0,null,"0Y",0,0,0,0,0,0,0,0,0,0,0,0,0,0,0,0,0,0,0,0,0,0,0,0,0,0,0,0,0,0,0,0,0]
[null,0,{"$f":"C226","v":116},null,null,null,null,null,null,null,null,null,"______",0,null,"0Y",0,0,0,0,0,0,0,0,0,0,0,0,0,0,0,0,0,0,0,0,0,0,0,0,0,0,0,0,0,0,0,0,0]
[null,0,{"$f":"C227","v":117},null,null,null,null,null,null,null,null,null,"______",0,null,"0Y",0,0,0,0,0,0,0,0,0,0,0,0,0,0,0,0,0,0,0,0,0,0,0,0,0,0,0,0,0,0,0,0,0]
[null,0,{"$f":"C228","v":118},null,null,null,null,null,null,null,null,null,"______",0,null,"0Y",0,0,0,0,0,0,0,0,0,0,0,0,0,0,0,0,0,0,0,0,0,0,0,0,0,0,0,0,0,0,0,0,0]
[null,0,{"$f":"C229","v":119},null,null,null,null,null,null,null,null,null,"______",0,null,"0Y",0,0,0,0,0,0,0,0,0,0,0,0,0,0,0,0,0,0,0,0,0,0,0,0,0,0,0,0,0,0,0,0,0]
[null,0,{"$f":"C230","v":120},null,null,null,null,null,null,null,null,null,"______",0,null,"0Y",0,0,0,0,0,0,0,0,0,0,0,0,0,0,0,0,0,0,0,0,0,0,0,0,0,0,0,0,0,0,0,0,0]
[null,0,{"$f":"C231","v":121},null,null,null,null,null,null,null,null,null,"______",0,null,"0Y",0,0,0,0,0,0,0,0,0,0,0,0,0,0,0,0,0,0,0,0,0,0,0,0,0,0,0,0,0,0,0,0,0]
[null,0,{"$f":"C232","v":122},null,null,null,null,null,null,null,null,null,"______",0,null,"0Y",0,0,0,0,0,0,0,0,0,0,0,0,0,0,0,0,0,0,0,0,0,0,0,0,0,0,0,0,0,0,0,0,0]
[null,0,{"$f":"C233","v":123},null,null,null,null,null,null,null,null,null,"______",0,null,"0Y",0,0,0,0,0,0,0,0,0,0,0,0,0,0,0,0,0,0,0,0,0,0,0,0,0,0,0,0,0,0,0,0,0]
[]
[null,{"$f":"B110","v":"Unique ID"},{"$f":"C110","v":"Path Reference"},null,null,null,null,null,null,null,null,null,null,"Sum Nos at each point",null,null,{"$f":"Q103","v":"Display"},"Has the member ever been a member of the Civil Service Pension arrangements?","Has the member ever been a member of the public service pension arrangements?","Was the member previously in the alpha scheme?","Was the member in either public or civil service on 1/4/2012?","Was the member MORE THAN 13.5 years to the public or civil pension service NPA @ 1/4/2012","Was the member LESS THAN 10 years to the public or civil pension service NPA @ 1/4/2012","As the member was in Civil Service at 31/3/2012 they should have taken part in the Options Exercise.  Did the member opt to move on their Taper Date (Y)?","Is the member fully protected?","Is the member's start date less than their Taper Date?",0,"Alpha rejoiner?","PCSPS rejoiner?","Did the member resign from their previous service?","Was the member dismissed due to inefficiency, end of fixed term contract or did their Fixed Term Appointment (FTA) end?","Did the take an approved early retirement (AER)?","Did the member take an age retirement? ","Did the member take an ill-health retirement? ","Did the member take an early retirement (ARR)? ","Did the member leave WITH early leaver reserved rights? ","Did the member leave WITHOUT early leaver reserved rights? ","Did the member have more than two years' qualifying service? ","Was the member's previous scheme classic? ","Was the member's previous scheme nuvos? ","Did the member receive a compensation payment? ","Did the member have pre-2010 CSCS terms? ","Does the member have a Civil Service pension in payment? ","Did the member re-join within 6 months? ","Did the member re-join within 5 years? ","Was the member's previous scheme partnership? ","Did the member retire on a lower tier ill health?",0,{"$f":"AW103","v":0}]
[null,{"$f":"B111","v":"134242304Y4198400N"},1,null,null,null,null,null,null,null,null,null,{"$f":"M111","v":"Scheme - alpha or partnership_alpha_alpha Paragraph E_Y___"},null,{"$f":"SUM(Q364:AH364)","v":28672},{"$f":"O364&\"N\"","v":"28672N"},{"$f":"IF(Q111=\"N\",Q$100,0)","v":0},{"$f":"IF(R111=\"N\",R$100,0)+Q364","v":0},{"$f":"IF(S111=\"N\",S$100,0)+R364","v":0},{"$f":"IF(T111=\"N\",T$100,0)+S364","v":0},{"$f":"IF(U111=\"N\",U$100,0)+T364","v":0},{"$f":"IF(V111=\"N\",V$100,0)+U364","v":0},{"$f":"IF(W111=\"N\",W$100,0)+V364","v":0},{"$f":"IF(X111=\"N\",X$100,0)+W364","v":0},{"$f":"IF(Y111=\"N\",Y$100,0)+X364","v":0},{"$f":"IF(Z111=\"N\",Z$100,0)+Y364","v":0},{"$f":"IF(AA111=\"N\",AA$100,0)+Z364","v":0},{"$f":"IF(AB111=\"N\",AB$100,0)+AA364","v":4096},{"$f":"IF(AC111=\"N\",AC$100,0)+AB364","v":4096},{"$f":"IF(AD111=\"N\",AD$100,0)+AC364","v":4096},{"$f":"IF(AE111=\"N\",AE$100,0)+AD364","v":4096},{"$f":"IF(AF111=\"N\",AF$100,0)+AE364","v":4096},{"$f":"IF(AG111=\"N\",AG$100,0)+AF364","v":4096},{"$f":"IF(AH111=\"N\",AH$100,0)+AG364","v":4096},{"$f":"IF(AI111=\"N\",AI$100,0)+AH364","v":4096},{"$f":"IF(AJ111=\"N\",AJ$100,0)+AI364","v":4096},{"$f":"IF(AK111=\"N\",AK$100,0)+AJ364","v":4096},{"$f":"IF(AL111=\"N\",AL$100,0)+AK364","v":4198400},{"$f":"IF(AM111=\"N\",AM$100,0)+AL364","v":4198400},{"$f":"IF(AN111=\"N\",AN$100,0)+AM364","v":4198400},{"$f":"IF(AO111=\"N\",AO$100,0)+AN364","v":4198400},{"$f":"IF(AP111=\"N\",AP$100,0)+AO364","v":4198400},{"$f":"IF(AQ111=\"N\",AQ$100,0)+AP364","v":4198400},{"$f":"IF(AR111=\"N\",AR$100,0)+AQ364","v":4198400},{"$f":"IF(AS111=\"N\",AS$100,0)+AR364","v":4198400},{"$f":"IF(AT111=\"N\",AT$100,0)+AS364","v":4198400},{"$f":"IF(AU111=\"N\",AU$100,0)+AT364","v":4198400},{"$f":"IF(AV111=\"N\",AV$100,0)+AU364","v":4198400},{"$f":"IF(AW111=\"N\",AW$100,0)+AV364","v":4198400}]
[null,{"$f":"B112","v":"24576Y138416128N"},{"$f":"C112","v":2},null,null,null,null,null,null,null,null,null,{"$f":"M112","v":"Scheme - alpha or partnership_alpha_alpha Paragraph A_ ___"},null,{"$f":"SUM(Q365:AH365)","v":28672},{"$f":"O365&\"N\"","v":"28672N"},{"$f":"IF(Q112=\"N\",Q$100,0)","v":0},{"$f":"IF(R112=\"N\",R$100,0)+Q365","v":0},0,0,0,0,0,0,0,0,0,{"$f":"IF(AB112=\"N\",AB$100,0)+AA365","v":4096},4096,4096,4096,4096,4096,4096,4096,4096,4096,4198400,4198400,4198400,4198400,4198400,138416128,138416128,138416128,138416128,138416128,138416128,138416128]
[null,"155213824Y4096N",{"$f":"C113","v":3},null,null,null,null,null,null,null,null,null,"Scheme - alpha or partnership_alpha_alpha Paragraph E_Y___",null,28672,"28672N",0,{"$f":"IF(R113=\"N\",R$100,0)+Q366","v":0},0,0,0,0,0,0,0,0,0,4096,4096,4096,4096,4096,4096,4096,4096,4096,4096,4096,4096,4096,4096,4096,4096,4096,4096,4096,4096,4096,4096]
[null,"20996096Y134221824N",{"$f":"C114","v":4},null,null,null,null,null,null,null,null,null,"Scheme - alpha or partnership_alpha_alpha Paragraph A____",null,28672,"28672N",0,0,0,0,0,0,0,0,0,0,0,4096,4096,4096,4096,4096,4096,4096,4096,4096,4096,4096,4096,4096,4096,4096,134221824,134221824,134221824,134221824,134221824,134221824,134221824]
[null,"138436608Y16781312N",{"$f":"C115","v":5},null,null,null,null,null,null,null,null,null,"Scheme - alpha or partnership_alpha_alpha Paragraph E_Y___",null,28672,"28672N",0,0,0,0,0,0,0,0,0,0,0,4096,4096,4096,4096,4096,4096,4096,4096,4096,4096,4096,4096,16781312,16781312,16781312,16781312,16781312,16781312,16781312,16781312,16781312,16781312]
[null,"1614831616Y150999040N",{"$f":"C116","v":6},null,null,null,null,null,null,null,null,null,"Scheme - alpha or partnership_alpha_alpha Paragraph A____",null,28672,"28672N",0,0,0,0,0,0,0,0,0,0,0,4096,4096,4096,4096,4096,4096,4096,4096,4096,4096,4096,4096,16781312,16781312,16781312,150999040,150999040,150999040,150999040,150999040,150999040,150999040]
[null,"541089792Y1224740864N",{"$f":"C117","v":7},null,null,null,null,null,null,null,null,null,"Scheme - alpha or partnership_alpha_alpha Paragraph G____",null,28672,"28672N",0,0,0,0,0,0,0,0,0,0,0,4096,4096,4096,4096,4096,4096,4096,4096,4096,4096,4096,4096,16781312,16781312,16781312,150999040,150999040,150999040,1224740864,1224740864,1224740864,1224740864]
[null,"4218880Y687869952N",{"$f":"C118","v":8},null,null,null,null,null,null,null,null,null,"Scheme - alpha or partnership_alpha_alpha Paragraph A____",null,28672,"28672N",0,0,0,0,0,0,0,0,0,0,0,4096,4096,4096,4096,4096,4096,4096,4096,4096,4096,4096,4096,16781312,16781312,16781312,150999040,150999040,687869952,687869952,687869952,687869952,687869952]
[null,"453025792Y4214784N",{"$f":"C119","v":9},null,null,null,null,null,null,null,null,null,"Scheme - alpha or partnership_alpha_alpha Paragraph M_Y_Y - Check £100,000 compensation limit__",null,110592,"110592N",0,0,0,0,0,0,0,0,0,0,0,4096,4096,20480,20480,20480,20480,20480,20480,20480,20480,4214784,4214784,4214784,4214784,4214784,4214784,4214784,4214784,4214784,4214784,4214784,4214784]
[null,"184590336Y272650240N",{"$f":"C120","v":10},null,null,null,null,null,null,null,null,null,"Scheme - alpha or partnership_alpha_alpha Paragraph E_Y___",null,110592,"110592N",0,0,0,0,0,0,0,0,0,0,0,4096,4096,20480,20480,20480,20480,20480,20480,20480,20480,4214784,4214784,4214784,4214784,4214784,4214784,272650240,272650240,272650240,272650240,272650240,272650240]
[null,"318808064Y138432512N",{"$f":"C121","v":11},null,null,null,null,null,null,null,null,null,"Scheme - alpha or partnership_alpha_alpha Paragraph M__Y - Check £100,000 compensation limit__",null,110592,"110592N",0,0,0,0,0,0,0,0,0,0,0,4096,4096,20480,20480,20480,20480,20480,20480,20480,20480,4214784,4214784,4214784,4214784,4214784,138432512,138432512,138432512,138432512,138432512,138432512,138432512]
[null,"50372608Y406867968N",{"$f":"C122","v":12},null,null,null,null,null,null,null,null,null,"Scheme - alpha or partnership_alpha_alpha Paragraph A____",null,110592,"110592N",0,0,0,0,0,0,0,0,0,0,0,4096,4096,20480,20480,20480,20480,20480,20480,20480,20480,4214784,4214784,4214784,4214784,4214784,138432512,406867968,406867968,406867968,406867968,406867968,406867968]
[null,"151035904Y37769216N",{"$f":"C123","v":13},null,null,null,null,null,null,null,null,null,"Scheme - alpha or partnership_alpha_alpha Paragraph E_Y___",null,110592,"110592N",0,0,0,0,0,0,0,0,0,0,0,4096,4096,20480,20480,20480,20480,20480,20480,20480,20480,4214784,4214784,4214784,37769216,37769216,37769216,37769216,37769216,37769216,37769216,37769216,37769216]
[null,"16818176Y171986944N",{"$f":"C124","v":14},null,null,null,null,null,null,null,null,null,"Scheme - alpha or partnership_alpha_alpha Paragraph A____",null,110592,"110592N",0,0,0,0,0,0,0,0,0,0,0,4096,4096,20480,20480,20480,20480,20480,20480,20480,20480,4214784,4214784,4214784,37769216,37769216,171986944,171986944,171986944,171986944,171986944,171986944,171986944]
[null,"436248576Y20992000N",{"$f":"C125","v":15},null,null,null,null,null,null,null,null,null,"Scheme - alpha or partnership_alpha_alpha Paragraph M_Y_Y - Check £100,000 compensation limit__",null,110592,"110592N",0,0,0,0,0,0,0,0,0,0,0,4096,4096,20480,20480,20480,20480,20480,20480,20480,20480,4214784,4214784,20992000,20992000,20992000,20992000,20992000,20992000,20992000,20992000,20992000,20992000]
[null,"704684032Y289427456N",{"$f":"C126","v":16},null,null,null,null,null,null,null,null,null,"Scheme - alpha or partnership_alpha_alpha Paragraph E_Y___",null,110592,"110592N",0,0,0,0,0,0,0,0,0,0,0,4096,4096,20480,20480,20480,20480,20480,20480,20480,20480,4214784,4214784,20992000,20992000,20992000,20992000,289427456,289427456,289427456,289427456,289427456,289427456]
[null,"167813120Y826298368N",{"$f":"C127","v":17},null,null,null,null,null,null,null,null,null,"Scheme - alpha or partnership_alpha_alpha Paragraph E_Y___",null,110592,"110592N",0,0,0,0,0,0,0,0,0,0,0,4096,4096,20480,20480,20480,20480,20480,20480,20480,20480,4214784,4214784,20992000,20992000,20992000,20992000,289427456,826298368,826298368,826298368,826298368,826298368]
[null,"302030848Y155209728N",{"$f":"C128","v":18},null,null,null,null,null,null,null,null,null,"Scheme - alpha or partnership_alpha_alpha Paragraph M____",null,110592,"110592N",0,0,0,0,0,0,0,0,0,0,0,4096,4096,20480,20480,20480,20480,20480,20480,20480,20480,4214784,4214784,20992000,20992000,20992000,155209728,155209728,155209728,155209728,155209728,155209728,155209728]
[null,"1644208128Y423645184N",{"$f":"C129","v":19},null,null,null,null,null,null,null,null,null,"Scheme - alpha or partnership_alpha_alpha Paragraph A____",null,110592,"110592N",0,0,0,0,0,0,0,0,0,0,0,4096,4096,20480,20480,20480,20480,20480,20480,20480,20480,4214784,4214784,20992000,20992000,20992000,155209728,423645184,423645184,423645184,423645184,423645184,423645184]
[null,"570466304Y1497387008N",{"$f":"C130","v":20},null,null,null,null,null,null,null,null,null,"Scheme - alpha or partnership_alpha_alpha Paragraph G____",null,110592,"110592N",0,0,0,0,0,0,0,0,0,0,0,4096,4096,20480,20480,20480,20480,20480,20480,20480,20480,4214784,4214784,20992000,20992000,20992000,155209728,423645184,423645184,1497387008,1497387008,1497387008,1497387008]
[null,"33595392Y960516096N",{"$f":"C131","v":21},null,null,null,null,null,null,null,null,null,"Scheme - alpha or partnership_alpha_alpha Paragraph A____",null,110592,"110592N",0,0,0,0,0,0,0,0,0,0,0,4096,4096,20480,20480,20480,20480,20480,20480,20480,20480,4214784,4214784,20992000,20992000,20992000,155209728,423645184,960516096,960516096,960516096,960516096,960516096]
[null,"134258688Y54546432N",{"$f":"C132","v":22},null,null,null,null,null,null,null,null,null,"Scheme - alpha or partnership_alpha_alpha Paragraph E_Y___",null,110592,"110592N",0,0,0,0,0,0,0,0,0,0,0,4096,4096,20480,20480,20480,20480,20480,20480,20480,20480,4214784,4214784,20992000,54546432,54546432,54546432,54546432,54546432,54546432,54546432,54546432,54546432]
[null,"1610653696Y188764160N",{"$f":"C133","v":23},null,null,null,null,null,null,null,null,null,"Scheme - alpha or partnership_alpha_alpha Paragraph A____",null,110592,"110592N",0,0,0,0,0,0,0,0,0,0,0,4096,4096,20480,20480,20480,20480,20480,20480,20480,20480,4214784,4214784,20992000,54546432,54546432,188764160,188764160,188764160,188764160,188764160,188764160,188764160]
[null,"536911872Y1262505984N",{"$f":"C134","v":24},null,null,null,null,null,null,null,null,null,"Scheme - alpha or partnership_alpha_alpha Paragraph A____",null,110592,"110592N",0,0,0,0,0,0,0,0,0,0,0,4096,4096,20480,20480,20480,20480,20480,20480,20480,20480,4214784,4214784,20992000,54546432,54546432,188764160,188764160,188764160,1262505984,1262505984,1262505984,1262505984]
[null,"40960Y725635072N",{"$f":"C135","v":25},null,null,null,null,null,null,null,null,null,"Scheme - alpha or partnership_alpha_alpha Paragraph A____",null,110592,"110592N",0,0,0,0,0,0,0,0,0,0,0,4096,4096,20480,20480,20480,20480,20480,20480,20480,20480,4214784,4214784,20992000,54546432,54546432,188764160,188764160,725635072,725635072,725635072,725635072,725635072]
[null,"457220096Y20480N",{"$f":"C136","v":26},null,null,null,null,null,null,null,null,null,"Scheme - alpha or partnership_alpha_alpha Paragraph M_Y_Y - Check £100,000 compensation limit__",null,110592,"110592N",0,0,0,0,0,0,0,0,0,0,0,4096,4096,20480,20480,20480,20480,20480,20480,20480,20480,20480,20480,20480,20480,20480,20480,20480,20480,20480,20480,20480,20480]
[null,"188784640Y268455936N",{"$f":"C137","v":27},null,null,null,null,null,null,null,null,null,"Scheme - alpha or partnership_alpha_alpha Paragraph E_Y___",null,110592,"110592N",0,0,0,0,0,0,0,0,0,0,0,4096,4096,20480,20480,20480,20480,20480,20480,20480,20480,20480,20480,20480,20480,20480,20480,268455936,268455936,268455936,268455936,268455936,268455936]
[null,"323002368Y134238208N",{"$f":"C138","v":28},null,null,null,null,null,null,null,null,null,"Scheme - alpha or partnership_alpha_alpha Paragraph M__Y - Check £100,000 compensation limit__",null,110592,"110592N",0,0,0,0,0,0,0,0,0,0,0,4096,4096,20480,20480,20480,20480,20480,20480,20480,20480,20480,20480,20480,20480,20480,134238208,134238208,134238208,134238208,134238208,134238208,134238208]
[null,"54566912Y402673664N",{"$f":"C139","v":29},null,null,null,null,null,null,null,null,null,"Scheme - alpha or partnership_alpha_alpha Paragraph A____",null,110592,"110592N",0,0,0,0,0,0,0,0,0,0,0,4096,4096,20480,20480,20480,20480,20480,20480,20480,20480,20480,20480,20480,20480,20480,134238208,402673664,402673664,402673664,402673664,402673664,402673664]
[null,"155230208Y33574912N",{"$f":"C140","v":30},null,null,null,null,null,null,null,null,null,"Scheme - alpha or partnership_alpha_alpha Paragraph E_Y___",null,110592,"110592N",0,0,0,0,0,0,0,0,0,0,0,4096,4096,20480,20480,20480,20480,20480,20480,20480,20480,20480,20480,20480,33574912,33574912,33574912,33574912,33574912,33574912,33574912,33574912,33574912]
[null,"21012480Y167792640N",{"$f":"C141","v":31},null,null,null,null,null,null,null,null,null,"Scheme - alpha or partnership_alpha_alpha Paragraph A____",null,110592,"110592N",0,0,0,0,0,0,0,0,0,0,0,4096,4096,20480,20480,20480,20480,20480,20480,20480,20480,20480,20480,20480,33574912,33574912,167792640,167792640,167792640,167792640,167792640,167792640,167792640]
[null,"440442880Y16797696N",{"$f":"C142","v":32},null,null,null,null,null,null,null,null,null,"Scheme - alpha or partnership_alpha_alpha Paragraph M_Y_Y - Check £100,000 compensation limit__",null,110592,"110592N",0,0,0,0,0,0,0,0,0,0,0,4096,4096,20480,20480,20480,20480,20480,20480,20480,20480,20480,20480,16797696,16797696,16797696,16797696,16797696,16797696,16797696,16797696,16797696,16797696]
[null,{"$f":"B143","v":"708878336Y285233152N"},{"$f":"C143","v":33},null,null,null,null,null,null,null,null,null,"Scheme - alpha or partnership_alpha_alpha Paragraph E_Y___",null,110592,"110592N",0,0,0,0,0,0,0,0,0,0,0,4096,4096,20480,20480,20480,20480,20480,20480,20480,20480,20480,20480,16797696,16797696,16797696,16797696,285233152,285233152,285233152,285233152,285233152,285233152]
[null,"172007424Y822104064N",{"$f":"C144","v":34},null,null,null,null,null,null,null,null,null,"Scheme - alpha or partnership_alpha_alpha Paragraph E_Y___",null,110592,"110592N",0,0,0,0,0,0,0,0,0,0,0,4096,4096,20480,20480,20480,20480,20480,20480,20480,20480,20480,20480,16797696,16797696,16797696,16797696,285233152,822104064,822104064,822104064,822104064,822104064]
[null,"306225152Y151015424N",{"$f":"C145","v":35},null,null,null,null,null,null,null,null,null,"Scheme - alpha or partnership_alpha_alpha Paragraph M____",null,110592,"110592N",0,0,0,0,0,0,0,0,0,0,0,4096,4096,20480,20480,20480,20480,20480,20480,20480,20480,20480,20480,16797696,16797696,16797696,151015424,151015424,151015424,151015424,151015424,151015424,151015424]
[null,"1648402432Y419450880N",{"$f":"C146","v":36},null,null,null,null,null,null,null,null,null,"Scheme - alpha or partnership_alpha_alpha Paragraph M____",null,110592,"110592N",0,0,0,0,0,0,0,0,0,0,0,4096,4096,20480,20480,20480,20480,20480,20480,20480,20480,20480,20480,16797696,16797696,16797696,151015424,419450880,419450880,419450880,419450880,419450880,419450880]
[null,"574660608Y1493192704N",{"$f":"C147","v":37},null,null,null,null,null,null,null,null,null,"Scheme - alpha or partnership_alpha_alpha Paragraph G____",null,110592,"110592N",0,0,0,0,0,0,0,0,0,0,0,4096,4096,20480,20480,20480,20480,20480,20480,20480,20480,20480,20480,16797696,16797696,16797696,151015424,419450880,419450880,1493192704,1493192704,1493192704,1493192704]
[null,"37789696Y956321792N",{"$f":"C148","v":38},null,null,null,null,null,null,null,null,null,"Scheme - alpha or partnership_alpha_alpha Paragraph A____",null,110592,"110592N",0,0,0,0,0,0,0,0,0,0,0,4096,4096,20480,20480,20480,20480,20480,20480,20480,20480,20480,20480,16797696,16797696,16797696,151015424,419450880,956321792,956321792,956321792,956321792,956321792]
[null,"138452992Y50352128N",{"$f":"C149","v":39},null,null,null,null,null,null,null,null,null,"Scheme - alpha or partnership_alpha_alpha Paragraph E_Y___",null,110592,"110592N",0,0,0,0,0,0,0,0,0,0,0,4096,4096,20480,20480,20480,20480,20480,20480,20480,20480,20480,20480,16797696,50352128,50352128,50352128,50352128,50352128,50352128,50352128,50352128,50352128]
[null,"1614848000Y184569856N",{"$f":"C150","v":40},null,null,null,null,null,null,null,null,null,"Scheme - alpha or partnership_alpha_alpha Paragraph A____",null,110592,"110592N",0,0,0,0,0,0,0,0,0,0,0,4096,4096,20480,20480,20480,20480,20480,20480,20480,20480,20480,20480,16797696,50352128,50352128,184569856,184569856,184569856,184569856,184569856,184569856,184569856]
[null,"541106176Y1258311680N",{"$f":"C151","v":41},null,null,null,null,null,null,null,null,null,"Scheme - alpha or partnership_alpha_alpha Paragraph G____",null,110592,"110592N",0,0,0,0,0,0,0,0,0,0,0,4096,4096,20480,20480,20480,20480,20480,20480,20480,20480,20480,20480,16797696,50352128,50352128,184569856,184569856,184569856,1258311680,1258311680,1258311680,1258311680]
[null,"4235264Y721440768N",{"$f":"C152","v":42},null,null,null,null,null,null,null,null,null,"Scheme - alpha or partnership_alpha_alpha Paragraph G____",null,110592,"110592N",0,0,0,0,0,0,0,0,0,0,0,4096,4096,20480,20480,20480,20480,20480,20480,20480,20480,20480,20480,16797696,50352128,50352128,184569856,184569856,721440768,721440768,721440768,721440768,721440768]
[null,"73728Y53248N",{"$f":"C153","v":43},null,null,null,null,null,null,null,null,null,"Scheme - alpha or partnership_alpha_alpha Paragraph E_Y___",null,241664,"241664N",0,0,0,0,0,0,0,0,0,0,0,4096,4096,20480,53248,53248,53248,53248,53248,53248,53248,53248,53248,53248,53248,53248,53248,53248,53248,53248,53248,53248,53248]
[null,"139264Y118784N",{"$f":"C154","v":44},null,null,null,null,null,null,null,null,null,"Scheme - alpha or partnership_alpha_alpha Paragraph E_Y___",null,438272,"438272N",0,0,0,0,0,0,0,0,0,0,0,4096,4096,20480,53248,118784,118784,118784,118784,118784,118784,118784,118784,118784,118784,118784,118784,118784,118784,118784,118784,118784,118784]
[null,"8658944Y249856N",{"$f":"C155","v":45},null,null,null,null,null,null,null,null,null,"Scheme - alpha or partnership_alpha_alpha Paragraph F_Y___",null,700416,"700416N",0,0,0,0,0,0,0,0,0,0,0,4096,4096,20480,53248,118784,249856,249856,249856,249856,249856,249856,249856,249856,249856,249856,249856,249856,249856,249856,249856,249856,249856]
[null,"2147753984Y8638464N",{"$f":"C156","v":46},null,null,null,null,null,null,null,null,null,"Scheme - alpha or partnership_alpha_alpha Paragraph F_Y___",null,700416,"700416N",0,0,0,0,0,0,0,0,0,0,0,4096,4096,20480,53248,118784,249856,249856,249856,249856,249856,249856,8638464,8638464,8638464,8638464,8638464,8638464,8638464,8638464,8638464,8638464,8638464]
[null,"270336Y2156122112N",{"$f":"C157","v":47},null,null,null,null,null,null,null,null,null,"Not eligible, Ill health assesment required refer to MyCSP______",null,700416,"700416N",0,0,0,0,0,0,0,0,0,0,0,4096,4096,20480,53248,118784,249856,249856,249856,249856,249856,249856,8638464,8638464,8638464,8638464,8638464,8638464,8638464,8638464,2156122112,2156122112,2156122112]
[null,"532480Y512000N",{"$f":"C158","v":48},null,null,null,null,null,null,null,null,null,"Scheme - alpha or partnership_alpha_alpha Paragraph E_Y___",null,962560,"962560N",0,0,0,0,0,0,0,0,0,0,0,4096,4096,20480,53248,118784,249856,512000,512000,512000,512000,512000,512000,512000,512000,512000,512000,512000,512000,512000,512000,512000,512000]
[null,"202383360Y1036288N",{"$f":"C159","v":49},null,null,null,null,null,null,null,null,null,"Scheme - alpha or partnership_alpha_alpha Paragraph E_Y_Y - Check £100,000 compensation limit_Y_",null,962560,"962560N",0,0,0,0,0,0,0,0,0,0,0,4096,4096,20480,53248,118784,249856,512000,1036288,1036288,1036288,1036288,1036288,1036288,1036288,1036288,1036288,1036288,1036288,1036288,1036288,1036288,1036288]
[null,"68165632Y135254016N",{"$f":"C160","v":50},null,null,null,null,null,null,null,null,null,"Scheme - alpha or partnership_alpha_alpha Paragraph A__Check £100,000 compensation limit_Y_",null,962560,"962560N",0,0,0,0,0,0,0,0,0,0,0,4096,4096,20480,53248,118784,249856,512000,1036288,1036288,1036288,1036288,1036288,1036288,1036288,1036288,135254016,135254016,135254016,135254016,135254016,135254016,135254016]
[null,"403709952Y68145152N",{"$f":"C161","v":51},null,null,null,null,null,null,null,null,null,"Scheme - alpha or partnership_alpha_alpha Paragraph M_Y_Y - Check £100,000 compensation limit_Y_",null,962560,"962560N",0,0,0,0,0,0,0,0,0,0,0,4096,4096,20480,53248,118784,249856,512000,1036288,1036288,1036288,1036288,1036288,1036288,1036288,68145152,68145152,68145152,68145152,68145152,68145152,68145152,68145152]
[null,"135274496Y336580608N",{"$f":"C162","v":52},null,null,null,null,null,null,null,null,null,"Scheme - alpha or partnership_alpha_alpha Paragraph E_Y_ Check £100,000 compensation limit_Y_",null,962560,"962560N",0,0,0,0,0,0,0,0,0,0,0,4096,4096,20480,53248,118784,249856,512000,1036288,1036288,1036288,1036288,1036288,1036288,1036288,68145152,68145152,336580608,336580608,336580608,336580608,336580608,336580608]
[null,"269492224Y202362880N",{"$f":"C163","v":53},null,null,null,null,null,null,null,null,null,"Scheme - alpha or partnership_alpha_alpha Paragraph M__Y - Check £100,000 compensation limit_Y_",null,962560,"962560N",0,0,0,0,0,0,0,0,0,0,0,4096,4096,20480,53248,118784,249856,512000,1036288,1036288,1036288,1036288,1036288,1036288,1036288,68145152,202362880,202362880,202362880,202362880,202362880,202362880,202362880]
[null,"1056768Y470798336N",{"$f":"C164","v":54},null,null,null,null,null,null,null,null,null,"Scheme - alpha or partnership_alpha_alpha Paragraph A__Check £100,000 compensation limit_Y_",null,962560,"962560N",0,0,0,0,0,0,0,0,0,0,0,4096,4096,20480,53248,118784,249856,512000,1036288,1036288,1036288,1036288,1036288,1036288,1036288,68145152,202362880,470798336,470798336,470798336,470798336,470798336,470798336]
[null,"203431936Y2084864N",{"$f":"C165","v":55},null,null,null,null,null,null,null,null,null,"Scheme - alpha or partnership_alpha_alpha Paragraph M_Y_Y - Check £100,000 compensation limit__",null,962560,"962560N",0,0,0,0,0,0,0,0,0,0,0,4096,4096,20480,53248,118784,249856,512000,1036288,2084864,2084864,2084864,2084864,2084864,2084864,2084864,2084864,2084864,2084864,2084864,2084864,2084864,2084864]
[null,"69214208Y136302592N",{"$f":"C166","v":56},null,null,null,null,null,null,null,null,null,"Scheme - alpha or partnership_alpha_alpha Paragraph A__Check £100,000 compensation limit__",null,962560,"962560N",0,0,0,0,0,0,0,0,0,0,0,4096,4096,20480,53248,118784,249856,512000,1036288,2084864,2084864,2084864,2084864,2084864,2084864,2084864,136302592,136302592,136302592,136302592,136302592,136302592,136302592]
[null,"404758528Y69193728N",{"$f":"C167","v":57},null,null,null,null,null,null,null,null,null,"Scheme - alpha or partnership_alpha_alpha Paragraph M_Y_Y - Check £100,000 compensation limit__",null,962560,"962560N",0,0,0,0,0,0,0,0,0,0,0,4096,4096,20480,53248,118784,249856,512000,1036288,2084864,2084864,2084864,2084864,2084864,2084864,69193728,69193728,69193728,69193728,69193728,69193728,69193728,69193728]
[null,"136323072Y337629184N",{"$f":"C168","v":58},null,null,null,null,null,null,null,null,null,"Scheme - alpha or partnership_alpha_alpha Paragraph E_Y_Check £100,000 compensation limit__",null,962560,"962560N",0,0,0,0,0,0,0,0,0,0,0,4096,4096,20480,53248,118784,249856,512000,1036288,2084864,2084864,2084864,2084864,2084864,2084864,69193728,69193728,337629184,337629184,337629184,337629184,337629184,337629184]
[null,"270540800Y203411456N",{"$f":"C169","v":59},null,null,null,null,null,null,null,null,null,"Scheme - alpha or partnership_alpha_alpha Paragraph M__Y - Check £100,000 compensation limit__",null,962560,"962560N",0,0,0,0,0,0,0,0,0,0,0,4096,4096,20480,53248,118784,249856,512000,1036288,2084864,2084864,2084864,2084864,2084864,2084864,69193728,203411456,203411456,203411456,203411456,203411456,203411456,203411456]
[null,"2105344Y471846912N",{"$f":"C170","v":60},null,null,null,null,null,null,null,null,null,"Scheme - alpha or partnership_alpha_alpha Paragraph A____",null,962560,"962560N",0,0,0,0,0,0,0,0,0,0,0,4096,4096,20480,53248,118784,249856,512000,1036288,2084864,2084864,2084864,2084864,2084864,2084864,69193728,203411456,471846912,471846912,471846912,471846912,471846912,471846912]
[null,0,{"$f":"C171","v":0},null,null,null,null,null,null,null,null,null,{"$error":"#REF!"},null,0,"0N",0,0,0,0,0,0,0,0,0,0,0,0,0,0,0,0,0,0,0,0,0,0,0,0,0,0,0,0,0,0,0,0,0]
[null,0,{"$f":"C172","v":0},null,null,null,null,null,null,null,null,null,"Not Found Carry On_Not Found Carry On_____",null,0,"0N",0,0,0,0,0,0,0,0,0,0,0,0,0,0,0,0,0,0,0,0,0,0,0,0,0,0,0,0,0,0,0,0,0]
[null,0,{"$f":"C173","v":0},null,null,null,null,null,null,null,null,null,"Not Found Carry On______",null,0,"0N",0,0,0,0,0,0,0,0,0,0,0,0,0,0,0,0,0,0,0,0,0,0,0,0,0,0,0,0,0,0,0,0,0]
[null,0,{"$f":"C174","v":0},null,null,null,null,null,null,null,null,null,"Not Found Carry On______",null,0,"0N",0,0,0,0,0,0,0,0,0,0,0,0,0,0,0,0,0,0,0,0,0,0,0,0,0,0,0,0,0,0,0,0,0]
[null,{"$f":"B175","v":0},{"$f":"C175","v":0},null,null,null,null,null,null,null,null,null,"Not Found Carry On______",null,0,"0N",0,0,{"$f":"IF(S175=\"N\",S$100,0)+R428","v":0},{"$f":"IF(T175=\"N\",T$100,0)+S428","v":0},{"$f":"IF(U175=\"N\",U$100,0)+T428","v":0},{"$f":"IF(V175=\"N\",V$100,0)+U428","v":0},{"$f":"IF(W175=\"N\",W$100,0)+V428","v":0},{"$f":"IF(X175=\"N\",X$100,0)+W428","v":0},{"$f":"IF(Y175=\"N\",Y$100,0)+X428","v":0},{"$f":"IF(Z175=\"N\",Z$100,0)+Y428","v":0},{"$f":"IF(AA175=\"N\",AA$100,0)+Z428","v":0},{"$f":"IF(AB175=\"N\",AB$100,0)+AA428","v":0},{"$f":"IF(AC175=\"N\",AC$100,0)+AB428","v":0},{"$f":"IF(AD175=\"N\",AD$100,0)+AC428","v":0},{"$f":"IF(AE175=\"N\",AE$100,0)+AD428","v":0},{"$f":"IF(AF175=\"N\",AF$100,0)+AE428","v":0},{"$f":"IF(AG175=\"N\",AG$100,0)+AF428","v":0},{"$f":"IF(AH175=\"N\",AH$100,0)+AG428","v":0},{"$f":"IF(AI175=\"N\",AI$100,0)+AH428","v":0},{"$f":"IF(AJ175=\"N\",AJ$100,0)+AI428","v":0},{"$f":"IF(AK175=\"N\",AK$100,0)+AJ428","v":0},{"$f":"IF(AL175=\"N\",AL$100,0)+AK428","v":0},{"$f":"IF(AM175=\"N\",AM$100,0)+AL428","v":0},{"$f":"IF(AN175=\"N\",AN$100,0)+AM428","v":0},{"$f":"IF(AO175=\"N\",AO$100,0)+AN428","v":0},{"$f":"IF(AP175=\"N\",AP$100,0)+AO428","v":0},{"$f":"IF(AQ175=\"N\",AQ$100,0)+AP428","v":0},{"$f":"IF(AR175=\"N\",AR$100,0)+AQ428","v":0},{"$f":"IF(AS175=\"N\",AS$100,0)+AR428","v":0},{"$f":"IF(AT175=\"N\",AT$100,0)+AS428","v":0},{"$f":"IF(AU175=\"N\",AU$100,0)+AT428","v":0},{"$f":"IF(AV175=\"N\",AV$100,0)+AU428","v":0},{"$f":"IF(AW175=\"N\",AW$100,0)+AV428","v":0}]
[null,0,{"$f":"C176","v":0},null,null,null,null,null,null,null,null,null,{"$f":"M176","v":"Not Found Carry On______"},null,{"$f":"SUM(Q429:AH429)","v":0},{"$f":"O429&\"N\"","v":"0N"},{"$f":"IF(Q176=\"N\",Q$100,0)","v":0},0,0,0,0,0,0,0,0,0,0,0,0,0,0,0,0,0,0,0,0,0,0,0,0,0,0,0,0,0,0,0,0]
[null,0,{"$f":"C177","v":0},null,null,null,null,null,null,null,null,null,"Not Found Carry On______",null,0,"0N",0,{"$f":"IF(R177=\"N\",R$100,0)+Q430","v":0},0,0,0,0,0,0,0,0,0,0,0,0,0,0,0,0,0,0,0,0,0,0,0,0,0,0,0,0,0,0,0]
[null,"69632Y57344N",{"$f":"C178","v":68},null,null,null,null,null,null,null,null,null,"Scheme - alpha or partnership_alpha_alpha Paragraph E_Y___",null,262144,"262144N",0,0,0,0,0,0,0,0,0,0,0,0,8192,24576,57344,57344,57344,57344,57344,57344,57344,57344,57344,57344,57344,57344,57344,57344,57344,57344,57344,57344,57344]
[null,"135168Y122880N",{"$f":"C179","v":69},null,null,null,null,null,null,null,null,null,"Scheme - alpha or partnership_alpha_alpha Paragraph E_Y___",null,458752,"458752N",0,0,0,0,0,0,0,0,0,0,0,0,8192,24576,57344,122880,122880,122880,122880,122880,122880,122880,122880,122880,122880,122880,122880,122880,122880,122880,122880,122880,122880]
[null,"2147749888Y253952N",{"$f":"C180","v":70},null,null,null,null,null,null,null,null,null,"Scheme - alpha or partnership_alpha_alpha Paragraph F_Y___",null,720896,"720896N",0,0,0,0,0,0,0,0,0,0,0,0,8192,24576,57344,122880,253952,253952,253952,253952,253952,253952,253952,253952,253952,253952,253952,253952,253952,253952,253952,253952,253952]
[null,"266240Y2147737600N",{"$f":"C181","v":71},null,null,null,null,null,null,null,null,null,"Not Eligibile__alpha Paragraph ____",null,720896,"720896N",0,0,0,0,0,{"$f":"IF(V181=\"N\",V$100,0)+U434","v":0},0,0,0,0,0,0,8192,24576,57344,122880,253952,253952,253952,253952,253952,253952,253952,253952,253952,253952,253952,253952,253952,253952,2147737600,2147737600,2147737600]
[null,"528384Y516096N",{"$f":"C182","v":72},null,null,null,null,null,null,null,null,null,"Scheme - alpha or partnership_alpha_alpha Paragraph E_Y___",null,983040,"983040N",0,0,0,0,0,{"$f":"IF(V182=\"N\",V$100,0)+U435","v":0},0,0,0,0,0,0,8192,24576,57344,122880,253952,516096,516096,516096,516096,516096,516096,516096,516096,516096,516096,516096,516096,516096,516096,516096,516096]
[null,"134238208Y8192N",{"$f":"C183","v":73},null,null,null,null,null,null,null,null,null,"Scheme - alpha or partnership_alpha_alpha Paragraph E_Y___",null,49152,"49152N",{"$f":"IF(Q183=\"N\",Q$100,0)","v":0},0,0,0,0,0,0,0,0,0,0,0,8192,8192,8192,8192,8192,8192,8192,8192,8192,8192,8192,8192,8192,8192,8192,8192,8192,8192,8192,8192,8192]
[null,"20480Y134225920N",{"$f":"C184","v":74},null,null,null,null,null,null,null,null,null,"Scheme - alpha or partnership_alpha_alpha Paragraph A____",null,49152,"49152N",{"$f":"IF(Q184=\"N\",Q$100,0)","v":0},0,0,0,0,0,0,0,0,0,0,0,8192,8192,8192,8192,8192,8192,8192,8192,8192,8192,8192,8192,8192,8192,134225920,134225920,134225920,134225920,134225920,134225920,134225920]
[null,"436244480Y24576N",{"$f":"C185","v":75},null,null,null,null,null,null,null,null,null,"Scheme - alpha or partnership_alpha_alpha Paragraph M_Y_Y - Check £100,000 compensation limit__",null,131072,"131072N",0,0,0,0,0,0,0,0,0,0,0,0,8192,24576,24576,24576,24576,24576,24576,24576,24576,24576,24576,24576,24576,24576,24576,24576,24576,24576,24576,24576,24576]
[null,"167809024Y268460032N",{"$f":"C186","v":76},null,null,null,null,null,null,null,null,null,"Scheme - alpha or partnership_alpha_alpha Paragraph E_Y___",null,131072,"131072N",0,0,0,0,0,0,0,0,0,0,0,0,8192,24576,24576,24576,24576,24576,24576,24576,24576,24576,24576,24576,24576,24576,24576,268460032,268460032,268460032,268460032,268460032,268460032]
[null,"302026752Y134242304N",{"$f":"C187","v":77},null,null,null,null,null,null,null,null,null,"Scheme - alpha or partnership_alpha_alpha Paragraph M__Y - Check £100,000 compensation limit__",null,131072,"131072N",0,0,0,0,0,0,0,0,0,0,0,0,8192,24576,24576,24576,24576,24576,24576,24576,24576,24576,24576,24576,24576,24576,134242304,134242304,134242304,134242304,134242304,134242304,134242304]
[null,"33591296Y402677760N",{"$f":"C188","v":78},null,null,null,null,null,null,null,null,null,"Scheme - alpha or partnership_alpha_alpha Paragraph A____",null,131072,"131072N",0,0,0,0,0,0,0,0,0,0,0,0,8192,24576,24576,24576,24576,24576,24576,24576,24576,24576,24576,24576,24576,24576,134242304,402677760,402677760,402677760,402677760,402677760,402677760]
[null,"134254592Y33579008N",{"$f":"C189","v":79},null,null,null,null,null,null,null,null,null,"Scheme - alpha or partnership_alpha_alpha Paragraph E_Y___",null,131072,"131072N",0,0,0,0,0,0,0,0,0,0,0,0,8192,24576,24576,24576,24576,24576,24576,24576,24576,24576,24576,24576,33579008,33579008,33579008,33579008,33579008,33579008,33579008,33579008,33579008]
[null,"36864Y167796736N",{"$f":"C190","v":80},null,null,null,null,null,null,null,null,null,"Scheme - alpha or partnership_alpha_alpha Paragraph A____",null,131072,"131072N",0,0,0,0,0,0,0,0,0,0,0,0,8192,24576,24576,24576,24576,24576,24576,24576,24576,24576,24576,24576,33579008,33579008,167796736,167796736,167796736,167796736,167796736,167796736,167796736]
[null,"202379264Y1040384N",{"$f":"C191","v":81},null,null,null,null,null,null,null,null,null,"Scheme - alpha or partnership_alpha_alpha Paragraph E_Y_Y - Check £100,000 compensation limit_Y_",null,983040,"983040N",0,0,0,0,0,0,0,0,0,0,0,0,8192,24576,57344,122880,253952,516096,1040384,1040384,1040384,1040384,1040384,1040384,1040384,1040384,1040384,1040384,1040384,1040384,1040384,1040384,1040384]
[null,"68161536Y135258112N",{"$f":"C192","v":82},null,null,null,null,null,null,null,null,null,"Scheme - alpha or partnership_alpha_alpha Paragraph A__Y - Check £100,000 compensation limit_Y_",null,983040,"983040N",0,0,0,0,0,0,0,0,0,0,0,0,8192,24576,57344,122880,253952,516096,1040384,1040384,1040384,1040384,1040384,1040384,1040384,1040384,135258112,135258112,135258112,135258112,135258112,135258112,135258112]
[null,"403705856Y68149248N",{"$f":"C193","v":83},null,null,null,null,null,null,null,null,null,"Scheme - alpha or partnership_alpha_alpha Paragraph M_Y_Y - Check £100,000 compensation limit_Y_",null,983040,"983040N",0,0,0,0,0,0,0,0,0,0,0,0,8192,24576,57344,122880,253952,516096,1040384,1040384,1040384,1040384,1040384,1040384,1040384,68149248,68149248,68149248,68149248,68149248,68149248,68149248,68149248]
[null,"135270400Y336584704N",{"$f":"C194","v":84},null,null,null,null,null,null,null,null,null,"Scheme - alpha or partnership_alpha_alpha Paragraph E_Y_Y - Check £100,000 compensation limit_Y_",null,983040,"983040N",0,0,0,0,0,0,0,0,0,0,0,0,8192,24576,57344,122880,253952,516096,1040384,1040384,1040384,1040384,1040384,1040384,1040384,68149248,68149248,336584704,336584704,336584704,336584704,336584704,336584704]
[null,"269488128Y202366976N",{"$f":"C195","v":85},null,null,null,null,null,null,null,null,null,"Scheme - alpha or partnership_alpha_alpha Paragraph M__Y - Check £100,000 compensation limit_Y_",null,983040,"983040N",0,0,0,0,0,0,0,0,0,0,0,0,8192,24576,57344,122880,253952,516096,1040384,1040384,1040384,1040384,1040384,1040384,1040384,68149248,202366976,202366976,202366976,202366976,202366976,202366976,202366976]
[null,"1052672Y470802432N",{"$f":"C196","v":86},null,null,null,null,null,null,null,null,null,"Scheme - alpha or partnership_alpha_alpha Paragraph A__Y - Check £100,000 compensation limit_Y_",null,983040,"983040N",0,0,0,0,0,0,0,0,0,0,0,0,8192,24576,57344,122880,253952,516096,1040384,1040384,1040384,1040384,1040384,1040384,1040384,68149248,202366976,470802432,470802432,470802432,470802432,470802432,470802432]
[null,"69210112Y2088960N",{"$f":"C197","v":87},null,null,null,null,null,null,null,null,null,"Scheme - alpha or partnership_alpha_alpha Paragraph E_Y_Y - Check £100,000 compensation limit_Y_",null,983040,"983040N",0,0,0,0,0,0,0,0,0,0,0,0,8192,24576,57344,122880,253952,516096,1040384,2088960,2088960,2088960,2088960,2088960,2088960,2088960,2088960,2088960,2088960,2088960,2088960,2088960,2088960]
[null,"2101248Y69197824N",{"$f":"C198","v":88},null,null,null,null,null,null,null,null,null,"Scheme - alpha or partnership_alpha_alpha Paragraph A__Y - Check £100,000 compensation limit__",null,983040,"983040N",0,0,0,0,0,0,0,0,0,0,0,0,8192,24576,57344,122880,253952,516096,1040384,2088960,2088960,2088960,2088960,2088960,2088960,69197824,69197824,69197824,69197824,69197824,69197824,69197824,69197824]
[null,"404754432Y69197824N",{"$f":"C199","v":89},null,null,null,null,null,null,null,null,null,"Scheme - alpha or partnership_alpha_alpha Paragraph M_Y_Y - Check £100,000 compensation limit__",null,983040,"983040N",0,0,0,0,0,0,0,0,0,0,0,0,8192,24576,57344,122880,253952,516096,1040384,2088960,2088960,2088960,2088960,2088960,2088960,69197824,69197824,69197824,69197824,69197824,69197824,69197824,69197824]
[null,"136318976Y337633280N",{"$f":"C200","v":90},null,null,null,null,null,null,null,null,null,"Scheme - alpha or partnership_alpha_alpha Paragraph E_Y_.__",null,983040,"983040N",0,0,0,0,0,0,0,0,0,0,0,0,8192,24576,57344,122880,253952,516096,1040384,2088960,2088960,2088960,2088960,2088960,2088960,69197824,69197824,337633280,337633280,337633280,337633280,337633280,337633280]
[null,"270536704Y203415552N",{"$f":"C201","v":91},null,null,null,null,null,null,null,null,null,"Scheme - alpha or partnership_alpha_alpha Paragraph M__Y - Check £100,000 compensation limit__",null,983040,"983040N",0,0,0,0,0,0,0,0,0,0,0,0,8192,24576,57344,122880,253952,516096,1040384,2088960,2088960,2088960,2088960,2088960,2088960,69197824,203415552,203415552,203415552,203415552,203415552,203415552,203415552]
[null,"2101248Y471851008N",{"$f":"C202","v":92},null,null,null,null,null,null,null,null,null,"Scheme - alpha or partnership_alpha_alpha Paragraph A____",null,983040,"983040N",0,0,0,0,0,0,0,0,0,0,0,0,8192,24576,57344,122880,253952,516096,1040384,2088960,2088960,2088960,2088960,2088960,2088960,69197824,203415552,471851008,471851008,471851008,471851008,471851008,471851008]
[null,0,{"$f":"C203","v":93},null,null,null,null,null,null,null,null,null,"ALPHA REJOINER - Not used Logic Tree______",null,0,"0N",0,0,0,0,0,0,0,0,0,0,0,0,0,0,0,0,0,0,0,0,0,0,0,0,0,0,0,0,0,0,0,0,0]
[null,0,{"$f":"C204","v":94},null,null,null,null,null,null,null,null,null,"PCSPS REJOINER - Not used Logic Tree______",null,0,"0N",0,0,0,0,0,0,0,0,0,0,0,0,0,0,0,0,0,0,0,0,0,0,0,0,0,0,0,0,0,0,0,0,0]
[null,0,{"$f":"C205","v":95},null,null,null,null,null,null,null,null,null,"ALPHA REJOINER - Not used Logic Tree______",null,0,"0N",0,0,0,0,0,0,0,0,0,0,0,0,0,0,0,0,0,0,0,0,0,0,0,0,0,0,0,0,0,0,0,0,0]
[null,0,{"$f":"C206","v":96},null,null,null,null,null,null,null,null,null,"PCSPS REJOINER - Not used Logic Tree______",null,0,"0N",0,0,0,0,0,0,0,0,0,0,0,0,0,0,0,0,0,0,0,0,0,0,0,0,0,0,0,0,0,0,0,0,0]
[null,{"$f":"B207","v":0},{"$f":"C207","v":97},null,null,null,null,null,null,null,null,null,"ALPHA REJOINER - Not used Logic Tree______",null,0,"0N",0,0,0,0,0,0,0,0,0,0,0,0,0,0,0,0,0,0,0,0,0,0,0,0,0,0,0,0,0,0,0,0,0]
[null,0,{"$f":"C208","v":98},null,null,null,null,null,null,null,null,null,"ALPHA REJOINER - Not used Logic Tree______",null,0,"0N",0,0,0,0,0,0,0,0,0,0,0,0,0,0,0,0,0,0,0,0,0,0,0,0,0,0,0,0,0,0,0,0,0]
[null,0,{"$f":"C209","v":99},null,null,null,null,null,null,null,null,null,"ALPHA REJOINER - Not used Logic Tree______",null,0,"0N",0,0,0,0,0,0,0,0,0,0,0,0,0,0,0,0,0,0,0,0,0,0,0,0,0,0,0,0,0,0,0,0,0]
[null,"4Y12592N",{"$f":"C210","v":100},null,null,null,null,null,null,null,null,null,"alpha_alpha Paragraph A_____",null,81328,"81328N",0,0,0,16,48,48,48,304,304,304,{"$f":"IF(AA210=\"N\",AA$100,0)+Z463","v":304},4400,12592,12592,12592,12592,12592,12592,12592,12592,12592,12592,12592,12592,12592,12592,12592,12592,12592,12592,12592,12592,12592]
[null,"8Y12596N",{"$f":"C211","v":101},null,null,null,null,null,null,null,null,null,"Scheme - alpha or partnership_alpha_alpha Paragraph A____",null,81396,"81396N",0,4,4,20,52,52,52,308,308,308,308,4404,12596,12596,12596,12596,12596,12596,12596,12596,12596,12596,12596,12596,12596,12596,12596,12596,12596,12596,12596,12596,12596]
[null,"744Y12564N",{"$f":"C212","v":61},null,null,null,null,null,null,null,null,null,"Scheme - alpha or partnership_alpha_alpha Paragraph A____",null,80948,"80948N",0,4,4,20,20,20,20,276,276,276,276,4372,12564,12564,12564,12564,12564,12564,12564,12564,12564,12564,12564,12564,12564,12564,12564,12564,12564,12564,12564,12564,12564]
[null,"232Y13076N",{"$f":"C213","v":62},null,null,null,null,null,null,null,null,null,"Scheme - alpha or partnership_alpha_alpha Paragraph A____",null,86068,"86068N",0,4,4,20,20,20,20,276,788,788,788,4884,13076,13076,13076,13076,13076,13076,13076,13076,13076,13076,13076,13076,13076,13076,13076,13076,13076,13076,13076,13076,13076]
[null,"1128Y13204N",{"$f":"C214","v":63},null,null,null,null,null,null,null,null,null,"Scheme - alpha or partnership_alpha_alpha Paragraph A____",null,87604,"87604N",0,4,4,20,20,20,148,404,916,916,916,5012,13204,13204,13204,13204,13204,13204,13204,13204,13204,13204,13204,13204,13204,13204,13204,13204,13204,13204,13204,13204,13204]
[null,"104Y14228N",{"$f":"C215","v":64},null,null,null,null,null,null,null,null,null,"Scheme - alpha or partnership_alpha_alpha Paragraph A____",null,96820,"96820N",0,4,4,20,20,20,148,404,916,1940,1940,6036,14228,14228,14228,14228,14228,14228,14228,14228,14228,14228,14228,14228,14228,14228,14228,14228,14228,14228,14228,14228,14228]
[null,"1128Y12692N",{"$f":"C216","v":65},null,null,null,null,null,null,null,null,null,"Scheme - alpha or partnership_alpha_alpha Paragraph A____",null,82484,"82484N",0,4,4,20,20,20,148,404,404,404,404,4500,12692,12692,12692,12692,12692,12692,12692,12692,12692,12692,12692,12692,12692,12692,12692,12692,12692,12692,12692,12692,12692]
[null,"40Y12628N",{"$f":"C217","v":66},null,null,null,null,null,null,null,null,null,"Scheme - alpha or partnership_alpha_alpha Paragraph A____",null,81780,"81780N",0,4,4,20,20,84,84,340,340,340,340,4436,12628,12628,12628,12628,12628,12628,12628,12628,12628,12628,12628,12628,12628,12628,12628,12628,12628,12628,12628,12628,12628]
[null,"0Y12572N",{"$f":"C218","v":67},null,null,null,null,null,null,null,null,null,"Scheme - alpha or partnership_alpha_alpha Paragraph A____",null,81076,"81076N",0,4,12,28,28,28,28,284,284,284,284,4380,12572,12572,12572,12572,12572,12572,12572,12572,12572,12572,12572,12572,12572,12572,12572,12572,12572,12572,12572,12572,12572]
[null,0,{"$f":"C219","v":102},null,null,null,null,null,null,null,null,null,"alpha_alpha Paragraph A_____",null,0,"0N",0,0,0,0,0,0,0,0,0,0,0,0,0,0,0,0,0,0,0,0,0,0,0,0,0,0,0,0,0,0,0,0,0]
[null,0,{"$f":"C220","v":110},null,null,null,null,null,null,null,null,null,"______",null,0,"0N",0,0,0,0,0,0,0,0,0,0,0,0,0,0,0,0,0,0,0,0,0,0,0,0,0,0,0,0,0,0,0,0,0]
[null,0,{"$f":"C221","v":111},null,null,null,null,null,null,null,null,null,"ALPHA REJOINER - Not used Logic Tree______",null,0,"0N",0,0,0,0,0,0,0,0,0,0,0,0,0,0,0,0,0,0,0,0,0,0,0,0,0,0,0,0,0,0,0,0,0]
[null,0,{"$f":"C222","v":112},null,null,null,null,null,null,null,null,null,"______",null,0,"0N",0,0,0,0,0,0,0,0,0,0,0,0,0,0,0,0,0,0,0,0,0,0,0,0,0,0,0,0,0,0,0,0,0]
[null,0,{"$f":"C223","v":113},null,null,null,null,null,null,null,null,null,"______",null,0,"0N",0,0,0,0,0,0,0,0,0,0,0,0,0,0,0,0,0,0,0,0,0,0,0,0,0,0,0,0,0,0,0,0,0]
[null,0,{"$f":"C224","v":114},null,null,null,null,null,null,null,null,null,"______",null,0,"0N",0,0,0,0,0,0,0,0,0,0,0,0,0,0,0,0,0,0,0,0,0,0,0,0,0,0,0,0,0,0,0,0,0]
[null,0,{"$f":"C225","v":115},null,null,null,null,null,null,null,null,null,"______",null,0,"0N",0,0,0,0,0,0,0,0,0,0,0,0,0,0,0,0,0,0,0,0,0,0,0,0,0,0,0,0,0,0,0,0,0]
[null,0,{"$f":"C226","v":116},null,null,null,null,null,null,null,null,null,"______",null,0,"0N",0,0,0,0,0,0,0,0,0,0,0,0,0,0,0,0,0,0,0,0,0,0,0,0,0,0,0,0,0,0,0,0,0]
[null,0,{"$f":"C227","v":117},null,null,null,null,null,null,null,null,null,"______",null,0,"0N",0,0,0,0,0,0,0,0,0,0,0,0,0,0,0,0,0,0,0,0,0,0,0,0,0,0,0,0,0,0,0,0,0]
[null,0,{"$f":"C228","v":118},null,null,null,null,null,null,null,null,null,"______",null,0,"0N",0,0,0,0,0,0,0,0,0,0,0,0,0,0,0,0,0,0,0,0,0,0,0,0,0,0,0,0,0,0,0,0,0]
[null,0,{"$f":"C229","v":119},null,null,null,null,null,null,null,null,null,"______",null,0,"0N",0,0,0,0,0,0,0,0,0,0,0,0,0,0,0,0,0,0,0,0,0,0,0,0,0,0,0,0,0,0,0,0,0]
[null,0,{"$f":"C230","v":120},null,null,null,null,null,null,null,null,null,"______",null,0,"0N",0,0,0,0,0,0,0,0,0,0,0,0,0,0,0,0,0,0,0,0,0,0,0,0,0,0,0,0,0,0,0,0,0]
[null,0,{"$f":"C231","v":121},null,null,null,null,null,null,null,null,null,"______",null,0,"0N",0,0,0,0,0,0,0,0,0,0,0,0,0,0,0,0,0,0,0,0,0,0,0,0,0,0,0,0,0,0,0,0,0]
[null,0,{"$f":"C232","v":122},null,null,null,null,null,null,null,null,null,"______",null,0,"0N",0,0,0,0,0,0,0,0,0,0,0,0,0,0,0,0,0,0,0,0,0,0,0,0,0,0,0,0,0,0,0,0,0]
[null,0,{"$f":"C233","v":123},null,null,null,null,null,null,null,null,null,"______",null,0,"0N",0,0,0,0,0,0,0,0,0,0,0,0,0,0,0,0,0,0,0,0,0,0,0,0,0,0,0,0,0,0,0,0,0]
[]
[null,null,null,null,null,null,null,null,null,null,null,null,null,null,null,"Question Code",{"$f":"Q102","v":"A"},"A0","A1","B","B2","C","D","E","F","G","H","0A","0B","1A","1B","1C","1D","1E","1F","1G","1H",1.5,"2A","2B",3,3.5,4,"5A","5B",6,7,0,{"$f":"AW102","v":0}]
[null,null,null,null,null,null,null,null,null,null,null,null,"Question to be displayed?",null,null,"tabbDisplayQuestion",{"$f":"IF(bfound=TRUE,\"FOUND\",IF(SUM(Q491:Q613)>0,TRUE,FALSE))","v":true},true,false,false,false,false,false,false,false,false,false,true,false,false,false,false,false,false,false,false,false,false,false,false,false,false,false,false,false,false,false,false,false]
[null,{"$f":"B110","v":"Unique ID"},{"$f":"C110","v":"Path Reference"},null,null,null,null,null,null,null,null,null,null,null,null,null,{"$f":"Q103","v":"Display"},"Has the member ever been a member of the Civil Service Pension arrangements?","Has the member ever been a member of the public service pension arrangements?","Was the member previously in the alpha scheme?","Was the member in either public or civil service on 1/4/2012?","Was the member MORE THAN 13.5 years to the public or civil pension service NPA @ 1/4/2012","Was the member LESS THAN 10 years to the public or civil pension service NPA @ 1/4/2012","As the member was in Civil Service at 31/3/2012 they should have taken part in the Options Exercise.  Did the member opt to move on their Taper Date (Y)?","Is the member fully protected?","Is the member's start date less than their Taper Date?",0,"Alpha rejoiner?","PCSPS rejoiner?","Did the member resign from their previous service?","Was the member dismissed due to inefficiency, end of fixed term contract or did their Fixed Term Appointment (FTA) end?","Did the take an approved early retirement (AER)?","Did the member take an age retirement? ","Did the member take an ill-health retirement? ","Did the member take an early retirement (ARR)? ","Did the member leave WITH early leaver reserved rights? ","Did the member leave WITHOUT early leaver reserved rights? ","Did the member have more than two years' qualifying service? ","Was the member's previous scheme classic? ","Was the member's previous scheme nuvos? ","Did the member receive a compensation payment? ","Did the member have pre-2010 CSCS terms? ","Does the member have a Civil Service pension in payment? ","Did the member re-join within 6 months? ","Did the member re-join within 5 years? ","Was the member's previous scheme partnership? ","Did the member retire on a lower tier ill health?",0,{"$f":"AW103","v":0}]
[null,"134242304Y4198400N",1,null,null,null,null,null,null,null,null,null,{"$f":"M111","v":"Scheme - alpha or partnership_alpha_alpha Paragraph E_Y___"},null,null,null,{"$f":"IF(Q111<>\"\",1,0)","v":1},{"$f":"IF(bfound=TRUE,0,IF(R111=\"\",0,IF(AND((Q$106=Q239),(Q$107=Q364)),1,0)))","v":0},0,0,0,0,0,0,0,0,0,1,0,0,0,0,0,0,0,0,0,0,0,0,0,0,0,0,0,0,0,0,0]
[null,"24576Y138416128N",{"$f":"C112","v":2},null,null,null,null,null,null,null,null,null,{"$f":"M112","v":"Scheme - alpha or partnership_alpha_alpha Paragraph A_ ___"},null,null,null,{"$f":"IF(Q112<>\"\",1,0)","v":1},{"$f":"IF(bfound=TRUE,0,IF(R112=\"\",0,IF(AND((Q$106=Q240),(Q$107=Q365)),1,0)))","v":0},0,0,0,0,0,0,0,0,0,1,0,0,0,0,0,0,0,0,0,0,0,0,0,0,0,0,0,0,0,0,0]
[null,"155213824Y4096N",{"$f":"C113","v":3},null,null,null,null,null,null,null,null,null,"Scheme - alpha or partnership_alpha_alpha Paragraph E_Y___",null,null,null,1,{"$f":"IF(bfound=TRUE,0,IF(R113=\"\",0,IF(AND((Q$106=Q241),(Q$107=Q366)),1,0)))","v":0},0,0,0,0,0,0,0,0,0,1,0,0,0,0,0,0,0,0,0,0,0,0,0,0,0,0,0,0,0,0,0]
[null,"20996096Y134221824N",{"$f":"C114","v":4},null,null,null,null,null,null,null,null,null,"Scheme - alpha or partnership_alpha_alpha Paragraph A____",null,null,null,1,{"$f":"IF(bfound=TRUE,0,IF(R114=\"\",0,IF(AND((Q$106=Q242),(Q$107=Q367)),1,0)))","v":0},0,0,0,0,0,0,0,0,0,1,0,0,0,0,0,0,0,0,0,0,0,0,0,0,0,0,0,0,0,0,0]
[null,"138436608Y16781312N",{"$f":"C115","v":5},null,null,null,null,null,null,null,null,null,"Scheme - alpha or partnership_alpha_alpha Paragraph E_Y___",null,null,null,1,{"$f":"IF(bfound=TRUE,0,IF(R115=\"\",0,IF(AND((Q$106=Q243),(Q$107=Q368)),1,0)))","v":0},0,0,0,0,0,0,0,0,0,1,0,0,0,0,0,0,0,0,0,0,0,0,0,0,0,0,0,0,0,0,0]
[null,"1614831616Y150999040N",{"$f":"C116","v":6},null,null,null,null,null,null,null,null,null,"Scheme - alpha or partnership_alpha_alpha Paragraph A____",null,null,null,1,{"$f":"IF(bfound=TRUE,0,IF(R116=\"\",0,IF(AND((Q$106=Q244),(Q$107=Q369)),1,0)))","v":0},0,0,0,0,0,0,0,0,0,1,0,0,0,0,0,0,0,0,0,0,0,0,0,0,0,0,0,0,0,0,0]
[null,"541089792Y1224740864N",{"$f":"C117","v":7},null,null,null,null,null,null,null,null,null,"Scheme - alpha or partnership_alpha_alpha Paragraph G____",null,null,null,1,{"$f":"IF(bfound=TRUE,0,IF(R117=\"\",0,IF(AND((Q$106=Q245),(Q$107=Q370)),1,0)))","v":0},0,0,0,0,0,0,0,0,0,1,0,0,0,0,0,0,0,0,0,0,0,0,0,0,0,0,0,0,0,0,0]
[null,"4218880Y687869952N",{"$f":"C118","v":8},null,null,null,null,null,null,null,null,null,"Scheme - alpha or partnership_alpha_alpha Paragraph A____",null,null,null,1,{"$f":"IF(bfound=TRUE,0,IF(R118=\"\",0,IF(AND((Q$106=Q246),(Q$107=Q371)),1,0)))","v":0},0,0,0,0,0,0,0,0,0,1,0,0,0,0,0,0,0,0,0,0,0,0,0,0,0,0,0,0,0,0,0]
[null,"453025792Y4214784N",{"$f":"C119","v":9},null,null,null,null,null,null,null,null,null,"Scheme - alpha or partnership_alpha_alpha Paragraph M_Y_Y - Check £100,000 compensation limit__",null,null,null,1,{"$f":"IF(bfound=TRUE,0,IF(R119=\"\",0,IF(AND((Q$106=Q247),(Q$107=Q372)),1,0)))","v":0},0,0,0,0,0,0,0,0,0,1,0,0,0,0,0,0,0,0,0,0,0,0,0,0,0,0,0,0,0,0,0]
[null,"184590336Y272650240N",{"$f":"C120","v":10},null,null,null,null,null,null,null,null,null,"Scheme - alpha or partnership_alpha_alpha Paragraph E_Y___",null,null,null,1,{"$f":"IF(bfound=TRUE,0,IF(R120=\"\",0,IF(AND((Q$106=Q248),(Q$107=Q373)),1,0)))","v":0},0,0,0,0,0,0,0,0,0,1,0,0,0,0,0,0,0,0,0,0,0,0,0,0,0,0,0,0,0,0,0]
[null,"318808064Y138432512N",{"$f":"C121","v":11},null,null,null,null,null,null,null,null,null,"Scheme - alpha or partnership_alpha_alpha Paragraph M__Y - Check £100,000 compensation limit__",null,null,null,1,{"$f":"IF(bfound=TRUE,0,IF(R121=\"\",0,IF(AND((Q$106=Q249),(Q$107=Q374)),1,0)))","v":0},0,0,0,0,0,0,0,0,0,1,0,0,0,0,0,0,0,0,0,0,0,0,0,0,0,0,0,0,0,0,0]
[null,"50372608Y406867968N",{"$f":"C122","v":12},null,null,null,null,null,null,null,null,null,"Scheme - alpha or partnership_alpha_alpha Paragraph A____",null,null,null,1,{"$f":"IF(bfound=TRUE,0,IF(R122=\"\",0,IF(AND((Q$106=Q250),(Q$107=Q375)),1,0)))","v":0},0,0,0,0,0,0,0,0,0,1,0,0,0,0,0,0,0,0,0,0,0,0,0,0,0,0,0,0,0,0,0]
[null,"151035904Y37769216N",{"$f":"C123","v":13},null,null,null,null,null,null,null,null,null,"Scheme - alpha or partnership_alpha_alpha Paragraph E_Y___",null,null,null,1,{"$f":"IF(bfound=TRUE,0,IF(R123=\"\",0,IF(AND((Q$106=Q251),(Q$107=Q376)),1,0)))","v":0},0,0,0,0,0,0,0,0,0,1,0,0,0,0,0,0,0,0,0,0,0,0,0,0,0,0,0,0,0,0,0]
[null,"16818176Y171986944N",{"$f":"C124","v":14},null,null,null,null,null,null,null,null,null,"Scheme - alpha or partnership_alpha_alpha Paragraph A____",null,null,null,1,{"$f":"IF(bfound=TRUE,0,IF(R124=\"\",0,IF(AND((Q$106=Q252),(Q$107=Q377)),1,0)))","v":0},0,0,0,0,0,0,0,0,0,1,0,0,0,0,0,0,0,0,0,0,0,0,0,0,0,0,0,0,0,0,0]
[null,"436248576Y20992000N",{"$f":"C125","v":15},null,null,null,null,null,null,null,null,null,"Scheme - alpha or partnership_alpha_alpha Paragraph M_Y_Y - Check £100,000 compensation limit__",null,null,null,1,{"$f":"IF(bfound=TRUE,0,IF(R125=\"\",0,IF(AND((Q$106=Q253),(Q$107=Q378)),1,0)))","v":0},0,0,0,0,0,0,0,0,0,1,0,0,0,0,0,0,0,0,0,0,0,0,0,0,0,0,0,0,0,0,0]
[null,"704684032Y289427456N",{"$f":"C126","v":16},null,null,null,null,null,null,null,null,null,"Scheme - alpha or partnership_alpha_alpha Paragraph E_Y___",null,null,null,1,{"$f":"IF(bfound=TRUE,0,IF(R126=\"\",0,IF(AND((Q$106=Q254),(Q$107=Q379)),1,0)))","v":0},0,0,0,0,0,0,0,0,0,1,0,0,0,0,0,0,0,0,0,0,0,0,0,0,0,0,0,0,0,0,0]
[null,"167813120Y826298368N",{"$f":"C127","v":17},null,null,null,null,null,null,null,null,null,"Scheme - alpha or partnership_alpha_alpha Paragraph E_Y___",null,null,null,1,{"$f":"IF(bfound=TRUE,0,IF(R127=\"\",0,IF(AND((Q$106=Q255),(Q$107=Q380)),1,0)))","v":0},0,0,0,0,0,0,0,0,0,1,0,0,0,0,0,0,0,0,0,0,0,0,0,0,0,0,0,0,0,0,0]
[null,"302030848Y155209728N",{"$f":"C128","v":18},null,null,null,null,null,null,null,null,null,"Scheme - alpha or partnership_alpha_alpha Paragraph M____",null,null,null,1,{"$f":"IF(bfound=TRUE,0,IF(R128=\"\",0,IF(AND((Q$106=Q256),(Q$107=Q381)),1,0)))","v":0},0,0,0,0,0,0,0,0,0,1,0,0,0,0,0,0,0,0,0,0,0,0,0,0,0,0,0,0,0,0,0]
[null,"1644208128Y423645184N",{"$f":"C129","v":19},null,null,null,null,null,null,null,null,null,"Scheme - alpha or partnership_alpha_alpha Paragraph A____",null,null,null,1,{"$f":"IF(bfound=TRUE,0,IF(R129=\"\",0,IF(AND((Q$106=Q257),(Q$107=Q382)),1,0)))","v":0},0,0,0,0,0,0,0,0,0,1,0,0,0,0,0,0,0,0,0,0,0,0,0,0,0,0,0,0,0,0,0]
[null,"570466304Y1497387008N",{"$f":"C130","v":20},null,null,null,null,null,null,null,null,null,"Scheme - alpha or partnership_alpha_alpha Paragraph G____",null,null,null,1,{"$f":"IF(bfound=TRUE,0,IF(R130=\"\",0,IF(AND((Q$106=Q258),(Q$107=Q383)),1,0)))","v":0},0,0,0,0,0,0,0,0,0,1,0,0,0,0,0,0,0,0,0,0,0,0,0,0,0,0,0,0,0,0,0]
[null,"33595392Y960516096N",{"$f":"C131","v":21},null,null,null,null,null,null,null,null,null,"Scheme - alpha or partnership_alpha_alpha Paragraph A____",null,null,null,1,{"$f":"IF(bfound=TRUE,0,IF(R131=\"\",0,IF(AND((Q$106=Q259),(Q$107=Q384)),1,0)))","v":0},0,0,0,0,0,0,0,0,0,1,0,0,0,0,0,0,0,0,0,0,0,0,0,0,0,0,0,0,0,0,0]
[null,"134258688Y54546432N",{"$f":"C132","v":22},null,null,null,null,null,null,null,null,null,"Scheme - alpha or partnership_alpha_alpha Paragraph E_Y___",null,null,null,1,{"$f":"IF(bfound=TRUE,0,IF(R132=\"\",0,IF(AND((Q$106=Q260),(Q$107=Q385)),1,0)))","v":0},0,0,0,0,0,0,0,0,0,1,0,0,0,0,0,0,0,0,0,0,0,0,0,0,0,0,0,0,0,0,0]
[null,"1610653696Y188764160N",{"$f":"C133","v":23},null,null,null,null,null,null,null,null,null,"Scheme - alpha or partnership_alpha_alpha Paragraph A____",null,null,null,1,{"$f":"IF(bfound=TRUE,0,IF(R133=\"\",0,IF(AND((Q$106=Q261),(Q$107=Q386)),1,0)))","v":0},0,0,0,0,0,0,0,0,0,1,0,0,0,0,0,0,0,0,0,0,0,0,0,0,0,0,0,0,0,0,0]
[null,"536911872Y1262505984N",{"$f":"C134","v":24},null,null,null,null,null,null,null,null,null,"Scheme - alpha or partnership_alpha_alpha Paragraph A____",null,null,null,1,{"$f":"IF(bfound=TRUE,0,IF(R134=\"\",0,IF(AND((Q$106=Q262),(Q$107=Q387)),1,0)))","v":0},0,0,0,0,0,0,0,0,0,1,0,0,0,0,0,0,0,0,0,0,0,0,0,0,0,0,0,0,0,0,0]
[null,"40960Y725635072N",{"$f":"C135","v":25},null,null,null,null,null,null,null,null,null,"Scheme - alpha or partnership_alpha_alpha Paragraph A____",null,null,null,1,{"$f":"IF(bfound=TRUE,0,IF(R135=\"\",0,IF(AND((Q$106=Q263),(Q$107=Q388)),1,0)))","v":0},0,0,0,0,0,0,0,0,0,1,0,0,0,0,0,0,0,0,0,0,0,0,0,0,0,0,0,0,0,0,0]
[null,"457220096Y20480N",{"$f":"C136","v":26},null,null,null,null,null,null,null,null,null,"Scheme - alpha or partnership_alpha_alpha Paragraph M_Y_Y - Check £100,000 compensation limit__",null,null,null,1,{"$f":"IF(bfound=TRUE,0,IF(R136=\"\",0,IF(AND((Q$106=Q264),(Q$107=Q389)),1,0)))","v":0},0,0,0,0,0,0,0,0,0,1,0,0,0,0,0,0,0,0,0,0,0,0,0,0,0,0,0,0,0,0,0]
[null,"188784640Y268455936N",{"$f":"C137","v":27},null,null,null,null,null,null,null,null,null,"Scheme - alpha or partnership_alpha_alpha Paragraph E_Y___",null,null,null,1,{"$f":"IF(bfound=TRUE,0,IF(R137=\"\",0,IF(AND((Q$106=Q265),(Q$107=Q390)),1,0)))","v":0},0,0,0,0,0,0,0,0,0,1,0,0,0,0,0,0,0,0,0,0,0,0,0,0,0,0,0,0,0,0,0]
[null,"323002368Y134238208N",{"$f":"C138","v":28},null,null,null,null,null,null,null,null,null,"Scheme - alpha or partnership_alpha_alpha Paragraph M__Y - Check £100,000 compensation limit__",null,null,null,1,{"$f":"IF(bfound=TRUE,0,IF(R138=\"\",0,IF(AND((Q$106=Q266),(Q$107=Q391)),1,0)))","v":0},0,0,0,0,0,0,0,0,0,1,0,0,0,0,0,0,0,0,0,0,0,0,0,0,0,0,0,0,0,0,0]
[null,"54566912Y402673664N",{"$f":"C139","v":29},null,null,null,null,null,null,null,null,null,"Scheme - alpha or partnership_alpha_alpha Paragraph A____",null,null,null,1,{"$f":"IF(bfound=TRUE,0,IF(R139=\"\",0,IF(AND((Q$106=Q267),(Q$107=Q392)),1,0)))","v":0},0,0,0,0,0,0,0,0,0,1,0,0,0,0,0,0,0,0,0,0,0,0,0,0,0,0,0,0,0,0,0]
[null,"155230208Y33574912N",{"$f":"C140","v":30},null,null,null,null,null,null,null,null,null,"Scheme - alpha or partnership_alpha_alpha Paragraph E_Y___",null,null,null,1,{"$f":"IF(bfound=TRUE,0,IF(R140=\"\",0,IF(AND((Q$106=Q268),(Q$107=Q393)),1,0)))","v":0},0,0,0,0,0,0,0,0,0,1,0,0,0,0,0,0,0,0,0,0,0,0,0,0,0,0,0,0,0,0,0]
[null,"21012480Y167792640N",{"$f":"C141","v":31},null,null,null,null,null,null,null,null,null,"Scheme - alpha or partnership_alpha_alpha Paragraph A____",null,null,null,1,{"$f":"IF(bfound=TRUE,0,IF(R141=\"\",0,IF(AND((Q$106=Q269),(Q$107=Q394)),1,0)))","v":0},0,0,0,0,0,0,0,0,0,1,0,0,0,0,0,0,0,0,0,0,0,0,0,0,0,0,0,0,0,0,0]
[null,"440442880Y16797696N",{"$f":"C142","v":32},null,null,null,null,null,null,null,null,null,"Scheme - alpha or partnership_alpha_alpha Paragraph M_Y_Y - Check £100,000 compensation limit__",null,null,null,1,{"$f":"IF(bfound=TRUE,0,IF(R142=\"\",0,IF(AND((Q$106=Q270),(Q$107=Q395)),1,0)))","v":0},0,0,0,0,0,0,0,0,0,1,0,0,0,0,0,0,0,0,0,0,0,0,0,0,0,0,0,0,0,0,0]
[null,{"$f":"B143","v":"708878336Y285233152N"},{"$f":"C143","v":33},null,null,null,null,null,null,null,null,null,"Scheme - alpha or partnership_alpha_alpha Paragraph E_Y___",null,null,null,1,{"$f":"IF(bfound=TRUE,0,IF(R143=\"\",0,IF(AND((Q$106=Q271),(Q$107=Q396)),1,0)))","v":0},0,0,0,0,0,0,0,0,0,1,0,0,0,0,0,0,0,0,0,0,0,0,0,0,0,0,0,0,0,0,0]
[null,"172007424Y822104064N",{"$f":"C144","v":34},null,null,null,null,null,null,null,null,null,"Scheme - alpha or partnership_alpha_alpha Paragraph E_Y___",null,null,null,1,{"$f":"IF(bfound=TRUE,0,IF(R144=\"\",0,IF(AND((Q$106=Q272),(Q$107=Q397)),1,0)))","v":0},0,0,0,0,0,0,0,0,0,1,0,0,0,0,0,0,0,0,0,0,0,0,0,0,0,0,0,0,0,0,0]
[null,"306225152Y151015424N",{"$f":"C145","v":35},null,null,null,null,null,null,null,null,null,"Scheme - alpha or partnership_alpha_alpha Paragraph M____",null,null,null,1,{"$f":"IF(bfound=TRUE,0,IF(R145=\"\",0,IF(AND((Q$106=Q273),(Q$107=Q398)),1,0)))","v":0},0,0,0,0,0,0,0,0,0,1,0,0,0,0,0,0,0,0,0,0,0,0,0,0,0,0,0,0,0,0,0]
[null,"1648402432Y419450880N",{"$f":"C146","v":36},null,null,null,null,null,null,null,null,null,"Scheme - alpha or partnership_alpha_alpha Paragraph M____",null,null,null,1,{"$f":"IF(bfound=TRUE,0,IF(R146=\"\",0,IF(AND((Q$106=Q274),(Q$107=Q399)),1,0)))","v":0},0,0,0,0,0,0,0,0,0,1,0,0,0,0,0,0,0,0,0,0,0,0,0,0,0,0,0,0,0,0,0]
[null,"574660608Y1493192704N",{"$f":"C147","v":37},null,null,null,null,null,null,null,null,null,"Scheme - alpha or partnership_alpha_alpha Paragraph G____",null,null,null,1,{"$f":"IF(bfound=TRUE,0,IF(R147=\"\",0,IF(AND((Q$106=Q275),(Q$107=Q400)),1,0)))","v":0},0,0,0,0,0,0,0,0,0,1,0,0,0,0,0,0,0,0,0,0,0,0,0,0,0,0,0,0,0,0,0]
[null,"37789696Y956321792N",{"$f":"C148","v":38},null,null,null,null,null,null,null,null,null,"Scheme - alpha or partnership_alpha_alpha Paragraph A____",null,null,null,1,{"$f":"IF(bfound=TRUE,0,IF(R148=\"\",0,IF(AND((Q$106=Q276),(Q$107=Q401)),1,0)))","v":0},0,0,0,0,0,0,0,0,0,1,0,0,0,0,0,0,0,0,0,0,0,0,0,0,0,0,0,0,0,0,0]
[null,"138452992Y50352128N",{"$f":"C149","v":39},null,null,null,null,null,null,null,null,null,"Scheme - alpha or partnership_alpha_alpha Paragraph E_Y___",null,null,null,1,{"$f":"IF(bfound=TRUE,0,IF(R149=\"\",0,IF(AND((Q$106=Q277),(Q$107=Q402)),1,0)))","v":0},0,0,0,0,0,0,0,0,0,1,0,0,0,0,0,0,0,0,0,0,0,0,0,0,0,0,0,0,0,0,0]
[null,"1614848000Y184569856N",{"$f":"C150","v":40},null,null,null,null,null,null,null,null,null,"Scheme - alpha or partnership_alpha_alpha Paragraph A____",null,null,null,1,{"$f":"IF(bfound=TRUE,0,IF(R150=\"\",0,IF(AND((Q$106=Q278),(Q$107=Q403)),1,0)))","v":0},0,0,0,0,0,0,0,0,0,1,0,0,0,0,0,0,0,0,0,0,0,0,0,0,0,0,0,0,0,0,0]
[null,"541106176Y1258311680N",{"$f":"C151","v":41},null,null,null,null,null,null,null,null,null,"Scheme - alpha or partnership_alpha_alpha Paragraph G____",null,null,null,1,{"$f":"IF(bfound=TRUE,0,IF(R151=\"\",0,IF(AND((Q$106=Q279),(Q$107=Q404)),1,0)))","v":0},0,0,0,0,0,0,0,0,0,1,0,0,0,0,0,0,0,0,0,0,0,0,0,0,0,0,0,0,0,0,0]
[null,"4235264Y721440768N",{"$f":"C152","v":42},null,null,null,null,null,null,null,null,null,"Scheme - alpha or partnership_alpha_alpha Paragraph G____",null,null,null,1,{"$f":"IF(bfound=TRUE,0,IF(R152=\"\",0,IF(AND((Q$106=Q280),(Q$107=Q405)),1,0)))","v":0},0,0,0,0,0,0,0,0,0,1,0,0,0,0,0,0,0,0,0,0,0,0,0,0,0,0,0,0,0,0,0]
[null,"73728Y53248N",{"$f":"C153","v":43},null,null,null,null,null,null,null,null,null,"Scheme - alpha or partnership_alpha_alpha Paragraph E_Y___",null,null,null,1,{"$f":"IF(bfound=TRUE,0,IF(R153=\"\",0,IF(AND((Q$106=Q281),(Q$107=Q406)),1,0)))","v":0},0,0,0,0,0,0,0,0,0,1,0,0,0,0,0,0,0,0,0,0,0,0,0,0,0,0,0,0,0,0,0]
[null,"139264Y118784N",{"$f":"C154","v":44},null,null,null,null,null,null,null,null,null,"Scheme - alpha or partnership_alpha_alpha Paragraph E_Y___",null,null,null,1,{"$f":"IF(bfound=TRUE,0,IF(R154=\"\",0,IF(AND((Q$106=Q282),(Q$107=Q407)),1,0)))","v":0},0,0,0,0,0,0,0,0,0,1,0,0,0,0,0,0,0,0,0,0,0,0,0,0,0,0,0,0,0,0,0]
[null,"8658944Y249856N",{"$f":"C155","v":45},null,null,null,null,null,null,null,null,null,"Scheme - alpha or partnership_alpha_alpha Paragraph F_Y___",null,null,null,1,{"$f":"IF(bfound=TRUE,0,IF(R155=\"\",0,IF(AND((Q$106=Q283),(Q$107=Q408)),1,0)))","v":0},0,0,0,0,0,0,0,0,0,1,0,0,0,0,0,0,0,0,0,0,0,0,0,0,0,0,0,0,0,0,0]
[null,"2147753984Y8638464N",{"$f":"C156","v":46},null,null,null,null,null,null,null,null,null,"Scheme - alpha or partnership_alpha_alpha Paragraph F_Y___",null,null,null,1,{"$f":"IF(bfound=TRUE,0,IF(R156=\"\",0,IF(AND((Q$106=Q284),(Q$107=Q409)),1,0)))","v":0},0,0,0,0,0,0,0,0,0,1,0,0,0,0,0,0,0,0,0,0,0,0,0,0,0,0,0,0,0,0,0]
[null,"270336Y2156122112N",{"$f":"C157","v":47},null,null,null,null,null,null,null,null,null,"Not eligible, Ill health assesment required refer to MyCSP______",null,null,null,1,{"$f":"IF(bfound=TRUE,0,IF(R157=\"\",0,IF(AND((Q$106=Q285),(Q$107=Q410)),1,0)))","v":0},0,0,0,0,0,0,0,0,0,1,0,0,0,0,0,0,0,0,0,0,0,0,0,0,0,0,0,0,0,0,0]
[null,"532480Y512000N",{"$f":"C158","v":48},null,null,null,null,null,null,null,null,null,"Scheme - alpha or partnership_alpha_alpha Paragraph E_Y___",null,null,null,1,{"$f":"IF(bfound=TRUE,0,IF(R158=\"\",0,IF(AND((Q$106=Q286),(Q$107=Q411)),1,0)))","v":0},0,0,0,0,0,0,0,0,0,1,0,0,0,0,0,0,0,0,0,0,0,0,0,0,0,0,0,0,0,0,0]
[null,"202383360Y1036288N",{"$f":"C159","v":49},null,null,null,null,null,null,null,null,null,"Scheme - alpha or partnership_alpha_alpha Paragraph E_Y_Y - Check £100,000 compensation limit_Y_",null,null,null,1,{"$f":"IF(bfound=TRUE,0,IF(R159=\"\",0,IF(AND((Q$106=Q287),(Q$107=Q412)),1,0)))","v":0},0,0,0,0,0,0,0,0,0,1,0,0,0,0,0,0,0,0,0,0,0,0,0,0,0,0,0,0,0,0,0]
[null,"68165632Y135254016N",{"$f":"C160","v":50},null,null,null,null,null,null,null,null,null,"Scheme - alpha or partnership_alpha_alpha Paragraph A__Check £100,000 compensation limit_Y_",null,null,null,1,{"$f":"IF(bfound=TRUE,0,IF(R160=\"\",0,IF(AND((Q$106=Q288),(Q$107=Q413)),1,0)))","v":0},0,0,0,0,0,0,0,0,0,1,0,0,0,0,0,0,0,0,0,0,0,0,0,0,0,0,0,0,0,0,0]
[null,"403709952Y68145152N",{"$f":"C161","v":51},null,null,null,null,null,null,null,null,null,"Scheme - alpha or partnership_alpha_alpha Paragraph M_Y_Y - Check £100,000 compensation limit_Y_",null,null,null,1,{"$f":"IF(bfound=TRUE,0,IF(R161=\"\",0,IF(AND((Q$106=Q289),(Q$107=Q414)),1,0)))","v":0},0,0,0,0,0,0,0,0,0,1,0,0,0,0,0,0,0,0,0,0,0,0,0,0,0,0,0,0,0,0,0]
[null,"135274496Y336580608N",{"$f":"C162","v":52},null,null,null,null,null,null,null,null,null,"Scheme - alpha or partnership_alpha_alpha Paragraph E_Y_ Check £100,000 compensation limit_Y_",null,null,null,1,{"$f":"IF(bfound=TRUE,0,IF(R162=\"\",0,IF(AND((Q$106=Q290),(Q$107=Q415)),1,0)))","v":0},0,0,0,0,0,0,0,0,0,1,0,0,0,0,0,0,0,0,0,0,0,0,0,0,0,0,0,0,0,0,0]
[null,"269492224Y202362880N",{"$f":"C163","v":53},null,null,null,null,null,null,null,null,null,"Scheme - alpha or partnership_alpha_alpha Paragraph M__Y - Check £100,000 compensation limit_Y_",null,null,null,1,{"$f":"IF(bfound=TRUE,0,IF(R163=\"\",0,IF(AND((Q$106=Q291),(Q$107=Q416)),1,0)))","v":0},0,0,0,0,0,0,0,0,0,1,0,0,0,0,0,0,0,0,0,0,0,0,0,0,0,0,0,0,0,0,0]
[null,"1056768Y470798336N",{"$f":"C164","v":54},null,null,null,null,null,null,null,null,null,"Scheme - alpha or partnership_alpha_alpha Paragraph A__Check £100,000 compensation limit_Y_",null,null,null,1,{"$f":"IF(bfound=TRUE,0,IF(R164=\"\",0,IF(AND((Q$106=Q292),(Q$107=Q417)),1,0)))","v":0},0,0,0,0,0,0,0,0,0,1,0,0,0,0,0,0,0,0,0,0,0,0,0,0,0,0,0,0,0,0,0]
[null,"203431936Y2084864N",{"$f":"C165","v":55},null,null,null,null,null,null,null,null,null,"Scheme - alpha or partnership_alpha_alpha Paragraph M_Y_Y - Check £100,000 compensation limit__",null,null,null,1,{"$f":"IF(bfound=TRUE,0,IF(R165=\"\",0,IF(AND((Q$106=Q293),(Q$107=Q418)),1,0)))","v":0},0,0,0,0,0,0,0,0,0,1,0,0,0,0,0,0,0,0,0,0,0,0,0,0,0,0,0,0,0,0,0]
[null,"69214208Y136302592N",{"$f":"C166","v":56},null,null,null,null,null,null,null,null,null,"Scheme - alpha or partnership_alpha_alpha Paragraph A__Check £100,000 compensation limit__",null,null,null,1,{"$f":"IF(bfound=TRUE,0,IF(R166=\"\",0,IF(AND((Q$106=Q294),(Q$107=Q419)),1,0)))","v":0},0,0,0,0,0,0,0,0,0,1,0,0,0,0,0,0,0,0,0,0,0,0,0,0,0,0,0,0,0,0,0]
[null,"404758528Y69193728N",{"$f":"C167","v":57},null,null,null,null,null,null,null,null,null,"Scheme - alpha or partnership_alpha_alpha Paragraph M_Y_Y - Check £100,000 compensation limit__",null,null,null,1,{"$f":"IF(bfound=TRUE,0,IF(R167=\"\",0,IF(AND((Q$106=Q295),(Q$107=Q420)),1,0)))","v":0},0,0,0,0,0,0,0,0,0,1,0,0,0,0,0,0,0,0,0,0,0,0,0,0,0,0,0,0,0,0,0]
[null,"136323072Y337629184N",{"$f":"C168","v":58},null,null,null,null,null,null,null,null,null,"Scheme - alpha or partnership_alpha_alpha Paragraph E_Y_Check £100,000 compensation limit__",null,null,null,1,{"$f":"IF(bfound=TRUE,0,IF(R168=\"\",0,IF(AND((Q$106=Q296),(Q$107=Q421)),1,0)))","v":0},0,0,0,0,0,0,0,0,0,1,0,0,0,0,0,0,0,0,0,0,0,0,0,0,0,0,0,0,0,0,0]
[null,"270540800Y203411456N",{"$f":"C169","v":59},null,null,null,null,null,null,null,null,null,"Scheme - alpha or partnership_alpha_alpha Paragraph M__Y - Check £100,000 compensation limit__",null,null,null,1,{"$f":"IF(bfound=TRUE,0,IF(R169=\"\",0,IF(AND((Q$106=Q297),(Q$107=Q422)),1,0)))","v":0},0,0,0,0,0,0,0,0,0,1,0,0,0,0,0,0,0,0,0,0,0,0,0,0,0,0,0,0,0,0,0]
[null,"2105344Y471846912N",{"$f":"C170","v":60},null,null,null,null,null,null,null,null,null,"Scheme - alpha or partnership_alpha_alpha Paragraph A____",null,null,null,1,{"$f":"IF(bfound=TRUE,0,IF(R170=\"\",0,IF(AND((Q$106=Q298),(Q$107=Q423)),1,0)))","v":0},0,0,0,0,0,0,0,0,0,1,0,0,0,0,0,0,0,0,0,0,0,0,0,0,0,0,0,0,0,0,0]
[null,0,{"$f":"C171","v":0},null,null,null,null,null,null,null,null,null,{"$error":"#REF!"},null,null,null,0,{"$f":"IF(bfound=TRUE,0,IF(R171=\"\",0,IF(AND((Q$106=Q299),(Q$107=Q424)),1,0)))","v":0},0,0,0,0,0,0,0,0,0,0,0,0,0,0,0,0,0,0,0,0,0,0,0,0,0,0,0,0,0,0,0]
[null,0,{"$f":"C172","v":0},null,null,null,null,null,null,null,null,null,"Not Found Carry On_Not Found Carry On_____",null,null,null,0,{"$f":"IF(bfound=TRUE,0,IF(R172=\"\",0,IF(AND((Q$106=Q300),(Q$107=Q425)),1,0)))","v":0},0,0,0,0,0,0,0,0,0,0,0,0,0,0,0,0,0,0,0,0,0,0,0,0,0,0,0,0,0,0,0]
[null,0,{"$f":"C173","v":0},null,null,null,null,null,null,null,null,null,"Not Found Carry On______",null,null,null,0,{"$f":"IF(bfound=TRUE,0,IF(R173=\"\",0,IF(AND((Q$106=Q301),(Q$107=Q426)),1,0)))","v":0},0,0,0,0,0,0,0,0,0,0,0,0,0,0,0,0,0,0,0,0,0,0,0,0,0,0,0,0,0,0,0]
[null,0,{"$f":"C174","v":0},null,null,null,null,null,null,null,null,null,"Not Found Carry On______",null,null,null,0,{"$f":"IF(bfound=TRUE,0,IF(R174=\"\",0,IF(AND((Q$106=Q302),(Q$107=Q427)),1,0)))","v":0},0,0,0,0,0,0,0,0,0,0,0,0,0,0,0,0,0,0,0,0,0,0,0,0,0,0,0,0,0,0,0]
[null,{"$f":"B175","v":0},{"$f":"C175","v":0},null,null,null,null,null,null,null,null,null,"Not Found Carry On______",null,null,null,0,{"$f":"IF(bfound=TRUE,0,IF(R175=\"\",0,IF(AND((Q$106=Q303),(Q$107=Q428)),1,0)))","v":0},0,0,0,0,0,0,0,0,0,0,0,0,0,0,0,0,0,0,0,0,0,0,0,0,0,0,0,0,0,0,0]
[null,0,{"$f":"C176","v":0},null,null,null,null,null,null,null,null,null,{"$f":"M176","v":"Not Found Carry On______"},null,null,null,{"$f":"IF(Q176<>\"\",1,0)","v":0},{"$f":"IF(bfound=TRUE,0,IF(R176=\"\",0,IF(AND((Q$106=Q304),(Q$107=Q429)),1,0)))","v":0},0,0,0,0,0,0,0,0,0,0,0,0,0,0,0,0,0,0,0,0,0,0,0,0,0,0,0,0,0,0,0]
[null,0,{"$f":"C177","v":0},null,null,null,null,null,null,null,null,null,"Not Found Carry On______",null,null,null,0,{"$f":"IF(bfound=TRUE,0,IF(R177=\"\",0,IF(AND((Q$106=Q305),(Q$107=Q430)),1,0)))","v":0},0,0,0,0,0,0,0,0,0,0,0,0,0,0,0,0,0,0,0,0,0,0,0,0,0,0,0,0,0,0,0]
[null,"69632Y57344N",{"$f":"C178","v":68},null,null,null,null,null,null,null,null,null,"Scheme - alpha or partnership_alpha_alpha Paragraph E_Y___",null,null,null,1,{"$f":"IF(bfound=TRUE,0,IF(R178=\"\",0,IF(AND((Q$106=Q306),(Q$107=Q431)),1,0)))","v":0},0,0,0,0,0,0,0,0,0,1,{"$f":"IF(bfound=TRUE,0,IF(AC178=\"\",0,IF(AND((AB$106=AB306),(AB$107=AB431)),1,0)))","v":0},{"$f":"IF(bfound=TRUE,0,IF(AD178=\"\",0,IF(AND((AC$106=AC306),(AC$107=AC431)),1,0)))","v":0},0,0,0,0,0,0,0,0,0,0,0,0,0,0,0,0,0,0,0]
[null,"135168Y122880N",{"$f":"C179","v":69},null,null,null,null,null,null,null,null,null,"Scheme - alpha or partnership_alpha_alpha Paragraph E_Y___",null,null,null,1,{"$f":"IF(bfound=TRUE,0,IF(R179=\"\",0,IF(AND((Q$106=Q307),(Q$107=Q432)),1,0)))","v":0},0,0,0,0,0,0,0,0,0,1,0,{"$f":"IF(bfound=TRUE,0,IF(AD179=\"\",0,IF(AND((AC$106=AC307),(AC$107=AC432)),1,0)))","v":0},0,0,0,0,0,0,0,0,0,0,0,0,0,0,0,0,0,0,0]
[null,"2147749888Y253952N",{"$f":"C180","v":70},null,null,null,null,null,null,null,null,null,"Scheme - alpha or partnership_alpha_alpha Paragraph F_Y___",null,null,null,1,{"$f":"IF(bfound=TRUE,0,IF(R180=\"\",0,IF(AND((Q$106=Q308),(Q$107=Q433)),1,0)))","v":0},0,0,0,0,0,0,0,0,0,1,0,0,0,0,0,0,0,0,0,0,0,0,0,0,0,0,0,0,0,0,0]
[null,"266240Y2147737600N",{"$f":"C181","v":71},null,null,null,null,null,null,null,null,null,"Not Eligibile__alpha Paragraph ____",null,null,null,1,{"$f":"IF(bfound=TRUE,0,IF(R181=\"\",0,IF(AND((Q$106=Q309),(Q$107=Q434)),1,0)))","v":0},0,0,0,0,0,0,0,0,0,1,0,0,0,0,0,0,0,0,0,0,0,0,0,0,0,0,0,0,0,0,0]
[null,"528384Y516096N",{"$f":"C182","v":72},null,null,null,null,null,null,null,null,null,"Scheme - alpha or partnership_alpha_alpha Paragraph E_Y___",null,null,null,1,{"$f":"IF(bfound=TRUE,0,IF(R182=\"\",0,IF(AND((Q$106=Q310),(Q$107=Q435)),1,0)))","v":0},0,0,0,0,0,0,0,0,0,1,0,0,0,0,0,0,0,0,0,0,0,0,0,0,0,0,0,0,0,0,0]
[null,"134238208Y8192N",{"$f":"C183","v":73},null,null,null,null,null,null,null,null,null,"Scheme - alpha or partnership_alpha_alpha Paragraph E_Y___",null,null,null,{"$f":"IF(Q183<>\"\",1,0)","v":1},{"$f":"IF(bfound=TRUE,0,IF(R183=\"\",0,IF(AND((Q$106=Q311),(Q$107=Q436)),1,0)))","v":0},0,0,0,0,0,0,0,0,0,1,0,0,0,0,0,0,0,0,0,0,0,0,0,0,{"$f":"IF(bfound=TRUE,0,IF(AQ183=\"\",0,IF(AND((AP$106=AP311),(AP$107=AP436)),1,0)))","v":0},0,0,0,0,0,0]
[null,"20480Y134225920N",{"$f":"C184","v":74},null,null,null,null,null,null,null,null,null,"Scheme - alpha or partnership_alpha_alpha Paragraph A____",null,null,null,{"$f":"IF(Q184<>\"\",1,0)","v":1},{"$f":"IF(bfound=TRUE,0,IF(R184=\"\",0,IF(AND((Q$106=Q312),(Q$107=Q437)),1,0)))","v":0},0,0,0,0,0,0,0,0,0,1,0,{"$f":"IF(bfound=TRUE,0,IF(AD184=\"\",0,IF(AND((AC$106=AC312),(AC$107=AC437)),1,0)))","v":0},0,0,0,0,0,0,0,0,0,0,0,0,0,0,0,0,0,0,0]
[null,"436244480Y24576N",{"$f":"C185","v":75},null,null,null,null,null,null,null,null,null,"Scheme - alpha or partnership_alpha_alpha Paragraph M_Y_Y - Check £100,000 compensation limit__",null,null,null,1,{"$f":"IF(bfound=TRUE,0,IF(R185=\"\",0,IF(AND((Q$106=Q313),(Q$107=Q438)),1,0)))","v":0},0,0,0,0,0,0,0,0,0,1,0,0,0,0,0,0,0,0,0,0,0,0,0,0,0,0,0,0,0,0,0]
[null,"167809024Y268460032N",{"$f":"C186","v":76},null,null,null,null,null,null,null,null,null,"Scheme - alpha or partnership_alpha_alpha Paragraph E_Y___",null,null,null,1,{"$f":"IF(bfound=TRUE,0,IF(R186=\"\",0,IF(AND((Q$106=Q314),(Q$107=Q439)),1,0)))","v":0},0,0,0,0,0,0,0,0,0,1,0,0,0,0,0,0,0,0,0,0,0,0,0,0,0,0,0,0,0,0,0]
[null,"302026752Y134242304N",{"$f":"C187","v":77},null,null,null,null,null,null,null,null,null,"Scheme - alpha or partnership_alpha_alpha Paragraph M__Y - Check £100,000 compensation limit__",null,null,null,1,{"$f":"IF(bfound=TRUE,0,IF(R187=\"\",0,IF(AND((Q$106=Q315),(Q$107=Q440)),1,0)))","v":0},0,0,0,0,0,0,0,0,0,1,0,0,0,0,0,0,0,0,0,0,0,0,0,0,0,0,0,0,0,0,0]
[null,"33591296Y402677760N",{"$f":"C188","v":78},null,null,null,null,null,null,null,null,null,"Scheme - alpha or partnership_alpha_alpha Paragraph A____",null,null,null,1,{"$f":"IF(bfound=TRUE,0,IF(R188=\"\",0,IF(AND((Q$106=Q316),(Q$107=Q441)),1,0)))","v":0},0,0,0,0,0,0,0,0,0,1,0,0,0,0,0,0,0,0,0,0,0,0,0,0,0,0,0,0,0,0,0]
[null,"134254592Y33579008N",{"$f":"C189","v":79},null,null,null,null,null,null,null,null,null,"Scheme - alpha or partnership_alpha_alpha Paragraph E_Y___",null,null,null,1,{"$f":"IF(bfound=TRUE,0,IF(R189=\"\",0,IF(AND((Q$106=Q317),(Q$107=Q442)),1,0)))","v":0},0,0,0,0,0,0,0,0,0,1,0,0,0,0,0,0,0,0,0,0,0,0,0,0,0,0,0,0,0,0,0]
[null,"36864Y167796736N",{"$f":"C190","v":80},null,null,null,null,null,null,null,null,null,"Scheme - alpha or partnership_alpha_alpha Paragraph A____",null,null,null,1,{"$f":"IF(bfound=TRUE,0,IF(R190=\"\",0,IF(AND((Q$106=Q318),(Q$107=Q443)),1,0)))","v":0},0,0,0,0,0,0,0,0,0,1,0,0,0,0,0,0,0,0,0,0,0,0,0,0,0,0,0,0,0,0,0]
[null,"202379264Y1040384N",{"$f":"C191","v":81},null,null,null,null,null,null,null,null,null,"Scheme - alpha or partnership_alpha_alpha Paragraph E_Y_Y - Check £100,000 compensation limit_Y_",null,null,null,1,{"$f":"IF(bfound=TRUE,0,IF(R191=\"\",0,IF(AND((Q$106=Q319),(Q$107=Q444)),1,0)))","v":0},0,0,0,0,0,0,0,0,0,1,0,0,0,0,0,0,0,0,0,0,0,0,0,0,0,0,0,0,0,0,0]
[null,"68161536Y135258112N",{"$f":"C192","v":82},null,null,null,null,null,null,null,null,null,"Scheme - alpha or partnership_alpha_alpha Paragraph A__Y - Check £100,000 compensation limit_Y_",null,null,null,1,{"$f":"IF(bfound=TRUE,0,IF(R192=\"\",0,IF(AND((Q$106=Q320),(Q$107=Q445)),1,0)))","v":0},0,0,0,0,0,0,0,0,0,1,0,0,0,0,0,0,0,0,0,0,0,0,0,0,0,0,0,0,0,0,0]
[null,"403705856Y68149248N",{"$f":"C193","v":83},null,null,null,null,null,null,null,null,null,"Scheme - alpha or partnership_alpha_alpha Paragraph M_Y_Y - Check £100,000 compensation limit_Y_",null,null,null,1,{"$f":"IF(bfound=TRUE,0,IF(R193=\"\",0,IF(AND((Q$106=Q321),(Q$107=Q446)),1,0)))","v":0},0,0,0,0,0,0,0,0,0,1,0,0,0,0,0,0,0,0,0,0,0,0,0,0,0,0,0,0,0,0,0]
[null,"135270400Y336584704N",{"$f":"C194","v":84},null,null,null,null,null,null,null,null,null,"Scheme - alpha or partnership_alpha_alpha Paragraph E_Y_Y - Check £100,000 compensation limit_Y_",null,null,null,1,{"$f":"IF(bfound=TRUE,0,IF(R194=\"\",0,IF(AND((Q$106=Q322),(Q$107=Q447)),1,0)))","v":0},0,0,0,0,0,0,0,0,0,1,0,0,0,0,0,0,0,0,0,0,0,0,0,0,0,0,0,0,0,0,0]
[null,"269488128Y202366976N",{"$f":"C195","v":85},null,null,null,null,null,null,null,null,null,"Scheme - alpha or partnership_alpha_alpha Paragraph M__Y - Check £100,000 compensation limit_Y_",null,null,null,1,{"$f":"IF(bfound=TRUE,0,IF(R195=\"\",0,IF(AND((Q$106=Q323),(Q$107=Q448)),1,0)))","v":0},0,0,0,0,0,0,0,0,0,1,0,0,0,0,0,0,0,0,0,0,0,0,0,0,0,0,0,0,0,0,0]
[null,"1052672Y470802432N",{"$f":"C196","v":86},null,null,null,null,null,null,null,null,null,"Scheme - alpha or partnership_alpha_alpha Paragraph A__Y - Check £100,000 compensation limit_Y_",null,null,null,1,{"$f":"IF(bfound=TRUE,0,IF(R196=\"\",0,IF(AND((Q$106=Q324),(Q$107=Q449)),1,0)))","v":0},0,0,0,0,0,0,0,0,0,1,0,0,0,0,0,0,0,0,0,0,0,0,0,0,0,0,0,0,0,0,0]
[null,"69210112Y2088960N",{"$f":"C197","v":87},null,null,null,null,null,null,null,null,null,"Scheme - alpha or partnership_alpha_alpha Paragraph E_Y_Y - Check £100,000 compensation limit_Y_",null,null,null,1,{"$f":"IF(bfound=TRUE,0,IF(R197=\"\",0,IF(AND((Q$106=Q325),(Q$107=Q450)),1,0)))","v":0},0,0,0,0,0,0,0,0,0,1,0,0,0,0,0,0,0,0,0,0,0,0,0,0,0,0,0,0,0,0,0]
[null,"2101248Y69197824N",{"$f":"C198","v":88},null,null,null,null,null,null,null,null,null,"Scheme - alpha or partnership_alpha_alpha Paragraph A__Y - Check £100,000 compensation limit__",null,null,null,1,{"$f":"IF(bfound=TRUE,0,IF(R198=\"\",0,IF(AND((Q$106=Q326),(Q$107=Q451)),1,0)))","v":0},0,0,0,0,0,0,0,0,0,1,0,0,0,0,0,0,0,0,0,0,0,0,0,0,0,0,0,0,0,0,0]
[null,"404754432Y69197824N",{"$f":"C199","v":89},null,null,null,null,null,null,null,null,null,"Scheme - alpha or partnership_alpha_alpha Paragraph M_Y_Y - Check £100,000 compensation limit__",null,null,null,1,{"$f":"IF(bfound=TRUE,0,IF(R199=\"\",0,IF(AND((Q$106=Q327),(Q$107=Q452)),1,0)))","v":0},0,0,0,0,0,0,0,0,0,1,0,0,0,0,0,0,0,0,0,0,0,0,0,0,0,0,0,0,0,0,0]
[null,"136318976Y337633280N",{"$f":"C200","v":90},null,null,null,null,null,null,null,null,null,"Scheme - alpha or partnership_alpha_alpha Paragraph E_Y_.__",null,null,null,1,{"$f":"IF(bfound=TRUE,0,IF(R200=\"\",0,IF(AND((Q$106=Q328),(Q$107=Q453)),1,0)))","v":0},0,0,0,0,0,0,0,0,0,1,0,0,0,0,0,0,0,0,0,0,0,0,0,0,0,0,0,0,0,0,0]
[null,"270536704Y203415552N",{"$f":"C201","v":91},null,null,null,null,null,null,null,null,null,"Scheme - alpha or partnership_alpha_alpha Paragraph M__Y - Check £100,000 compensation limit__",null,null,null,1,{"$f":"IF(bfound=TRUE,0,IF(R201=\"\",0,IF(AND((Q$106=Q329),(Q$107=Q454)),1,0)))","v":0},0,0,0,0,0,0,0,0,0,1,0,0,0,0,0,0,0,0,0,0,0,0,0,0,0,0,0,0,0,0,0]
[null,"2101248Y471851008N",{"$f":"C202","v":92},null,null,null,null,null,null,null,null,null,"Scheme - alpha or partnership_alpha_alpha Paragraph A____",null,null,null,1,{"$f":"IF(bfound=TRUE,0,IF(R202=\"\",0,IF(AND((Q$106=Q330),(Q$107=Q455)),1,0)))","v":0},0,0,0,0,0,0,0,0,0,1,0,0,0,0,0,0,0,0,0,0,0,0,0,0,0,0,0,0,0,0,0]
[null,0,{"$f":"C203","v":93},null,null,null,null,null,null,null,null,null,"ALPHA REJOINER - Not used Logic Tree______",null,null,null,0,{"$f":"IF(bfound=TRUE,0,IF(R203=\"\",0,IF(AND((Q$106=Q331),(Q$107=Q456)),1,0)))","v":0},0,0,0,0,0,0,0,0,0,0,0,0,0,0,0,0,0,0,0,0,0,0,0,0,0,0,0,0,0,0,0]
[null,0,{"$f":"C204","v":94},null,null,null,null,null,null,null,null,null,"PCSPS REJOINER - Not used Logic Tree______",null,null,null,0,{"$f":"IF(bfound=TRUE,0,IF(R204=\"\",0,IF(AND((Q$106=Q332),(Q$107=Q457)),1,0)))","v":0},0,0,0,0,0,0,0,0,0,0,0,0,0,0,0,0,0,0,0,0,0,0,0,0,0,0,0,0,0,0,0]
[null,0,{"$f":"C205","v":95},null,null,null,null,null,null,null,null,null,"ALPHA REJOINER - Not used Logic Tree______",null,null,null,0,{"$f":"IF(bfound=TRUE,0,IF(R205=\"\",0,IF(AND((Q$106=Q333),(Q$107=Q458)),1,0)))","v":0},0,0,0,0,0,0,0,0,0,0,0,0,0,0,0,0,0,0,0,0,0,0,0,0,0,0,0,0,0,0,0]
[null,0,{"$f":"C206","v":96},null,null,null,null,null,null,null,null,null,"PCSPS REJOINER - Not used Logic Tree______",null,null,null,0,{"$f":"IF(bfound=TRUE,0,IF(R206=\"\",0,IF(AND((Q$106=Q334),(Q$107=Q459)),1,0)))","v":0},0,0,0,0,0,0,0,0,0,0,0,0,0,0,0,0,0,0,0,0,0,0,0,0,0,0,0,0,0,0,0]
[null,{"$f":"B207","v":0},{"$f":"C207","v":97},null,null,null,null,null,null,null,null,null,"ALPHA REJOINER - Not used Logic Tree______",null,null,null,0,{"$f":"IF(bfound=TRUE,0,IF(R207=\"\",0,IF(AND((Q$106=Q335),(Q$107=Q460)),1,0)))","v":0},0,0,0,0,0,0,0,0,0,0,0,0,0,0,0,0,0,0,0,0,0,0,0,0,0,0,0,0,0,0,0]
[null,0,{"$f":"C208","v":98},null,null,null,null,null,null,null,null,null,"ALPHA REJOINER - Not used Logic Tree______",null,null,null,0,{"$f":"IF(bfound=TRUE,0,IF(R208=\"\",0,IF(AND((Q$106=Q336),(Q$107=Q461)),1,0)))","v":0},0,0,0,0,0,0,0,0,0,0,0,0,0,0,0,0,0,0,0,0,0,0,0,0,0,0,0,0,0,0,0]
[null,0,{"$f":"C209","v":99},null,null,null,null,null,null,null,null,null,"ALPHA REJOINER - Not used Logic Tree______",null,null,null,0,{"$f":"IF(bfound=TRUE,0,IF(R209=\"\",0,IF(AND((Q$106=Q337),(Q$107=Q462)),1,0)))","v":0},0,0,0,0,0,0,0,0,0,0,0,0,0,0,0,0,0,0,0,0,0,0,0,0,0,0,0,0,0,0,0]
[null,"4Y12592N",{"$f":"C210","v":100},null,null,null,null,null,null,null,null,null,"alpha_alpha Paragraph A_____",null,null,null,1,{"$f":"IF(bfound=TRUE,0,IF(R210=\"\",0,IF(AND((Q$106=Q338),(Q$107=Q463)),1,0)))","v":1},0,0,0,0,0,0,0,0,0,0,0,0,0,0,0,0,0,0,0,0,0,0,0,0,0,0,0,0,0,0,0]
[null,"8Y12596N",{"$f":"C211","v":101},null,null,null,null,null,null,null,null,null,"Scheme - alpha or partnership_alpha_alpha Paragraph A____",null,null,null,1,{"$f":"IF(bfound=TRUE,0,IF(R211=\"\",0,IF(AND((Q$106=Q339),(Q$107=Q464)),1,0)))","v":1},0,0,0,0,0,0,0,0,0,0,0,0,0,0,0,0,0,0,0,0,0,0,0,0,0,0,0,0,0,0,0]
[null,"744Y12564N",{"$f":"C212","v":61},null,null,null,null,null,null,null,null,null,"Scheme - alpha or partnership_alpha_alpha Paragraph A____",null,null,null,1,{"$f":"IF(bfound=TRUE,0,IF(R212=\"\",0,IF(AND((Q$106=Q340),(Q$107=Q465)),1,0)))","v":1},0,0,0,0,0,0,0,0,0,0,0,0,0,0,0,0,0,0,0,0,0,0,0,0,0,0,0,0,0,0,0]
[null,"232Y13076N",{"$f":"C213","v":62},null,null,null,null,null,null,null,null,null,"Scheme - alpha or partnership_alpha_alpha Paragraph A____",null,null,null,1,{"$f":"IF(bfound=TRUE,0,IF(R213=\"\",0,IF(AND((Q$106=Q341),(Q$107=Q466)),1,0)))","v":1},0,0,0,0,0,0,0,0,0,0,0,0,0,0,0,0,0,0,0,0,0,0,0,0,0,0,0,0,0,0,0]
[null,"1128Y13204N",{"$f":"C214","v":63},null,null,null,null,null,null,null,null,null,"Scheme - alpha or partnership_alpha_alpha Paragraph A____",null,null,null,1,{"$f":"IF(bfound=TRUE,0,IF(R214=\"\",0,IF(AND((Q$106=Q342),(Q$107=Q467)),1,0)))","v":1},0,0,0,0,0,0,0,0,0,0,0,0,0,0,0,0,0,0,0,0,0,0,0,0,0,0,0,0,0,0,0]
[null,"104Y14228N",{"$f":"C215","v":64},null,null,null,null,null,null,null,null,null,"Scheme - alpha or partnership_alpha_alpha Paragraph A____",null,null,null,1,{"$f":"IF(bfound=TRUE,0,IF(R215=\"\",0,IF(AND((Q$106=Q343),(Q$107=Q468)),1,0)))","v":1},0,0,0,0,0,0,0,0,0,0,0,0,0,0,0,0,0,0,0,0,0,0,0,0,0,0,0,0,0,0,0]
[null,"1128Y12692N",{"$f":"C216","v":65},null,null,null,null,null,null,null,null,null,"Scheme - alpha or partnership_alpha_alpha Paragraph A____",null,null,null,1,{"$f":"IF(bfound=TRUE,0,IF(R216=\"\",0,IF(AND((Q$106=Q344),(Q$107=Q469)),1,0)))","v":1},0,0,0,0,0,0,0,0,0,0,0,0,0,0,0,0,0,0,0,0,0,0,0,0,0,0,0,0,0,0,0]
[null,"40Y12628N",{"$f":"C217","v":66},null,null,null,null,null,null,null,null,null,"Scheme - alpha or partnership_alpha_alpha Paragraph A____",null,null,null,1,{"$f":"IF(bfound=TRUE,0,IF(R217=\"\",0,IF(AND((Q$106=Q345),(Q$107=Q470)),1,0)))","v":1},0,0,0,0,0,0,0,0,0,0,0,0,0,0,0,0,0,0,0,0,0,0,0,0,0,0,0,0,0,0,0]
[null,"0Y12572N",{"$f":"C218","v":67},null,null,null,null,null,null,null,null,null,"Scheme - alpha or partnership_alpha_alpha Paragraph A____",null,null,null,1,{"$f":"IF(bfound=TRUE,0,IF(R218=\"\",0,IF(AND((Q$106=Q346),(Q$107=Q471)),1,0)))","v":1},0,0,0,0,0,0,0,0,0,0,0,0,0,0,0,0,0,0,0,0,0,0,0,0,0,0,0,0,0,0,0]
[null,0,{"$f":"C219","v":102},null,null,null,null,null,null,null,null,null,"alpha_alpha Paragraph A_____",null,null,null,0,{"$f":"IF(bfound=TRUE,0,IF(R219=\"\",0,IF(AND((Q$106=Q347),(Q$107=Q472)),1,0)))","v":0},0,0,0,0,0,0,0,0,0,0,0,0,0,0,0,0,0,0,0,0,0,0,0,0,0,0,0,0,0,0,0]
[null,0,{"$f":"C220","v":110},null,null,null,null,null,null,null,null,null,"______",null,null,null,0,{"$f":"IF(bfound=TRUE,0,IF(R220=\"\",0,IF(AND((Q$106=Q348),(Q$107=Q473)),1,0)))","v":0},0,0,0,0,0,0,0,0,0,0,0,0,0,0,0,0,0,0,0,0,0,0,0,0,0,0,0,0,0,0,0]
[null,0,{"$f":"C221","v":111},null,null,null,null,null,null,null,null,null,"ALPHA REJOINER - Not used Logic Tree______",null,null,null,0,{"$f":"IF(bfound=TRUE,0,IF(R221=\"\",0,IF(AND((Q$106=Q349),(Q$107=Q474)),1,0)))","v":0},0,0,0,0,0,0,0,0,0,0,0,0,0,0,0,0,0,0,0,0,0,0,0,0,0,0,0,0,0,0,0]
[null,0,{"$f":"C222","v":112},null,null,null,null,null,null,null,null,null,"______",null,null,null,0,{"$f":"IF(bfound=TRUE,0,IF(R222=\"\",0,IF(AND((Q$106=Q350),(Q$107=Q475)),1,0)))","v":0},0,0,0,0,0,0,0,0,0,0,0,0,0,0,0,0,0,0,0,0,0,0,0,0,0,0,0,0,0,0,0]
[null,0,{"$f":"C223","v":113},null,null,null,null,null,null,null,null,null,"______",null,null,null,0,{"$f":"IF(bfound=TRUE,0,IF(R223=\"\",0,IF(AND((Q$106=Q351),(Q$107=Q476)),1,0)))","v":0},0,0,0,0,0,0,0,0,0,0,0,0,0,0,0,0,0,0,0,0,0,0,0,0,0,0,0,0,0,0,0]
[null,0,{"$f":"C224","v":114},null,null,null,null,null,null,null,null,null,"______",null,null,null,0,{"$f":"IF(bfound=TRUE,0,IF(R224=\"\",0,IF(AND((Q$106=Q352),(Q$107=Q477)),1,0)))","v":0},0,0,0,0,0,0,0,0,0,0,0,0,0,0,0,0,0,0,0,0,0,0,0,0,0,0,0,0,0,0,0]
[null,0,{"$f":"C225","v":115},null,null,null,null,null,null,null,null,null,"______",null,null,null,0,{"$f":"IF(bfound=TRUE,0,IF(R225=\"\",0,IF(AND((Q$106=Q353),(Q$107=Q478)),1,0)))","v":0},0,0,0,0,0,0,0,0,0,0,0,0,0,0,0,0,0,0,0,0,0,0,0,0,0,0,0,0,0,0,0]
[null,0,{"$f":"C226","v":116},null,null,null,null,null,null,null,null,null,"______",null,null,null,0,{"$f":"IF(bfound=TRUE,0,IF(R226=\"\",0,IF(AND((Q$106=Q354),(Q$107=Q479)),1,0)))","v":0},0,0,0,0,0,0,0,0,0,0,0,0,0,0,0,0,0,0,0,0,0,0,0,0,0,0,0,0,0,0,0]
[null,0,{"$f":"C227","v":117},null,null,null,null,null,null,null,null,null,"______",null,null,null,0,{"$f":"IF(bfound=TRUE,0,IF(R227=\"\",0,IF(AND((Q$106=Q355),(Q$107=Q480)),1,0)))","v":0},0,0,0,0,0,0,0,0,0,0,0,0,0,0,0,0,0,0,0,0,0,0,0,0,0,0,0,0,0,0,0]
[null,0,{"$f":"C228","v":118},null,null,null,null,null,null,null,null,null,"______",null,null,null,0,{"$f":"IF(bfound=TRUE,0,IF(R228=\"\",0,IF(AND((Q$106=Q356),(Q$107=Q481)),1,0)))","v":0},0,0,0,0,0,0,0,0,0,0,0,0,0,0,0,0,0,0,0,0,0,0,0,0,0,0,0,0,0,0,0]
[null,0,{"$f":"C229","v":119},null,null,null,null,null,null,null,null,null,"______",null,null,null,0,{"$f":"IF(bfound=TRUE,0,IF(R229=\"\",0,IF(AND((Q$106=Q357),(Q$107=Q482)),1,0)))","v":0},0,0,0,0,0,0,0,0,0,0,0,0,0,0,0,0,0,0,0,0,0,0,0,0,0,0,0,0,0,0,0]
[null,0,{"$f":"C230","v":120},null,null,null,null,null,null,null,null,null,"______",null,null,null,0,{"$f":"IF(bfound=TRUE,0,IF(R230=\"\",0,IF(AND((Q$106=Q358),(Q$107=Q483)),1,0)))","v":0},0,0,0,0,0,0,0,0,0,0,0,0,0,0,0,0,0,0,0,0,0,0,0,0,0,0,0,0,0,0,0]
[null,0,{"$f":"C231","v":121},null,null,null,null,null,null,null,null,null,"______",null,null,null,0,{"$f":"IF(bfound=TRUE,0,IF(R231=\"\",0,IF(AND((Q$106=Q359),(Q$107=Q484)),1,0)))","v":0},0,0,0,0,0,0,0,0,0,0,0,0,0,0,0,0,0,0,0,0,0,0,0,0,0,0,0,0,0,0,0]
[null,0,{"$f":"C232","v":122},null,null,null,null,null,null,null,null,null,"______",null,null,null,0,{"$f":"IF(bfound=TRUE,0,IF(R232=\"\",0,IF(AND((Q$106=Q360),(Q$107=Q485)),1,0)))","v":0},0,0,0,0,0,0,0,0,0,0,0,0,0,0,0,0,0,0,0,0,0,0,0,0,0,0,0,0,0,0,0]
[null,0,{"$f":"C233","v":123},null,null,null,null,null,null,null,null,null,"______",null,null,null,0,{"$f":"IF(bfound=TRUE,0,IF(R233=\"\",0,IF(AND((Q$106=Q361),(Q$107=Q486)),1,0)))","v":0},0,0,0,0,0,0,0,0,0,0,0,0,0,0,0,0,0,0,0,0,0,0,0,0,0,0,0,0,0,0,0]

{"sheet":"SPD Calculations_Hide","index":3,"n_rows":222,"n_cols":22,"rows_kept":222,"cut":false,"hidden":true,"merged":[[1,2,1,6],[32,1,32,2],[31,3,31,5]]}
[null,null,"SPD"]
[null,"Description","Calculates state pension date, state pension Age in Y, YM and age as string based on In force policy.  This is a MyCSP administration tool and is not for public use.  This page can be used in it's entirety as an SPA tool in other calculation  tools, however these must be kept up to date if this tool changes."]
[]
[]
[null,null,{"$f":"SPDToolName&\" -  Inputs\"","v":"SPD -  Inputs"}]
[]
[]
[null,"Inputs"]
[]
[null,"Date of Birth",{"$f":"'Joiner Calculations_hide'!DOB","v":"00:00:00"},"dayDOB"]
[]
[null,"Sex",{"$f":"Sex","v":0},"strSex"]
[]
[]
[null,null,{"$f":"SPDToolName&\" - Results\"","v":"SPD - Results"}]
[]
[]
[null,"Results"]
[]
[null,"State Pension Age as string as per .Gov site",{"$f":"IF(OR(bSexError,bDOBError),_errOverall,strSPA)","v":"SPA ERROR :Sex IncorrectFALSEDOB Incorrect"},"resstrSPA"]
[null,"State Pension  Date",{"$f":"IF(OR(bSexError),_errOverall,daySPD)","v":"SPA ERROR :Sex IncorrectFALSEDOB Incorrect"},"resdaySPD"]
[null,"State Pension Age In Complete Years (YY)",{"$f":"IF(OR(bSexError),_errOverall,dSPA_CY)","v":"SPA ERROR :Sex IncorrectFALSEDOB Incorrect"},"resdSPA_CY"]
[null,"State Pension Age In Complete Years and Months (YY+MM/12)",{"$f":"IF(OR(bSexError),_errOverall,dSPA_CYM)","v":"SPA ERROR :Sex IncorrectFALSEDOB Incorrect"},"resdSPA_CYM"]
[null,null,null,null,null,null,null,null,null,null,null,null," "]
[]
[]
[null,null,{"$f":"SPDToolName&\" - Calculations\"","v":"SPD - Calculations"}]
[]
[null,null,null,null,null,null,null,null,null,null,null,null,null,null,"daySPD","dSPA_CY","dSPA_CYM","strSPA"]
[null,"The data in this table (columns B to F) has been taken from the inforce pension acts.  For more information about the source of data refer to the MyCSP SPA Calculator Tool sheet 'BackgroundStats'.",null,null,null,null,null,null,null,null,null,null,"Results lookups : ",null,{"$f":"MAX(O34:O181)","v":"00:00:00"},{"$f":"MAX(P34:P181)","v":0},{"$f":"MAX(Q34:Q181)","v":0},{"$f":"VLOOKUP(dSPA_CYM,Q34:R122,2,0)","v":{"$error":"#N/A"}}]
[]
[null,null,null,"SPA is either defined as to an Age or Date, If age known complete age, if date known complete date.  All Ages YY+MM, where MM is m/12",null,null,null,"Intermediate Calculations",null,null,null,null,null,null,"Lookups"]
[null,"Period within which DOB falls",null,"Day pensionable age attained","Males SPA","Females SPA",null,"Use Date Or Age","State Pension Date (Calc)","SPA Year","SPA Month","SPA Day","SPA as string",null,"SPD Lookup","SPA Lookup Complete Years","SPA Lookup Complete Years And Months","SPA as String Lookup",null,"StartDOBY","StartDOBM","StartDOBD"]
[null,"1900-01-01","1950-04-05",null,65,60,null,{"$f":"IF(LEFT(LOWER(strSEX))=\"m\",IF(E34=\"\",\"Date\",\"Age\"), IF(LEFT(LOWER(strSEX))=\"f\",IF(F34=\"\",\"Date\",\"Age\"),\"N/A\"))","v":"N/A"},{"$f":"IF(H34=\"Age\",DATE(YEAR(dayDOB)+INT(IF(strSEX=\"Male\",E34,F34)),MONTH(dayDOB)+(IF(strSEX=\"Male\",(E34-INT(E34))*12,(F34-INT(F34))*12)),DAY(dayDOB)),D34)","v":"00:00:00"},{"$f":"YEAR(DATE(YEAR(I34+0)-YEAR(dayDOB),MONTH(I34+0)-MONTH(dayDOB)+1,DAY(I34+0)-DAY(dayDOB)+1))-1900","v":0},{"$f":"MONTH(DATE(YEAR(I34+0)-YEAR(dayDOB),MONTH(I34+0)-MONTH(dayDOB)+1,DAY(I34+0)-DAY(dayDOB)+1))-1","v":0},{"$f":"I34-DATE(YEAR(dayDOB)+J34,MONTH(dayDOB)+K34,DAY(dayDOB))-0","v":0},{"$f":"J34&\" Years \"&K34\n&\" Months \"&L34&\" Days\"","v":"0 Years 0 Months 0 Days"},null,{"$f":"IF(AND(dayDOB>=B34,dayDOB<=C34),I34,\"\")","v":""},{"$f":"IF(O34<>\"\",J34,\"\")","v":""},{"$f":"IF(O34<>\"\",J34+K34/12,\"\")","v":""},{"$f":"IF(P34<>\"\",M34,\"\")","v":""},null,{"$f":"YEAR(B34)","v":1900},{"$f":"MONTH(B34)","v":1},{"$f":"DAY(B34)","v":1}]
[null,"1950-04-06","1950-05-05","2010-05-06",65,null,null,"N/A","2010-05-06",110,4,6,"110 Years 4 Months 6 Days",null,"","","","",null,1950,4,6]
[null,"1950-05-06","1950-06-05","2010-07-06",65,null,null,"N/A","2010-07-06",110,6,6,"110 Years 6 Months 6 Days",null,"","","","",null,1950,5,6]
[null,"1950-06-06","1950-07-05","2010-09-06",65,null,null,"N/A","2010-09-06",110,8,6,"110 Years 8 Months 6 Days",null,"","","","",null,1950,6,6]
[null,"1950-07-06","1950-08-05","2010-11-06",65,null,null,"N/A","2010-11-06",110,10,6,"110 Years 10 Months 6 Days",null,"","","","",null,1950,7,6]
[null,"1950-08-06","1950-09-05","2011-01-06",65,null,null,"N/A","2011-01-06",111,0,6,"111 Years 0 Months 6 Days",null,"","","","",null,1950,8,6]
[null,"1950-09-06","1950-10-05","2011-03-06",65,null,null,"N/A","2011-03-06",111,2,6,"111 Years 2 Months 6 Days",null,"","","","",null,1950,9,6]
[null,"1950-10-06","1950-11-05","2011-05-06",65,null,null,"N/A","2011-05-06",111,4,6,"111 Years 4 Months 6 Days",null,"","","","",null,1950,10,6]
[null,"1950-11-06","1950-12-05","2011-07-06",65,null,null,"N/A","2011-07-06",111,6,6,"111 Years 6 Months 6 Days",null,"","","","",null,1950,11,6]
[null,"1950-12-06","1951-01-05","2011-09-06",65,null,null,"N/A","2011-09-06",111,8,6,"111 Years 8 Months 6 Days",null,"","","","",null,1950,12,6]
[null,"1951-01-06","1951-02-05","2011-11-06",65,null,null,"N/A","2011-11-06",111,10,6,"111 Years 10 Months 6 Days",null,"","","","",null,1951,1,6]
[null,"1951-02-06","1951-03-05","2012-01-06",65,null,null,"N/A","2012-01-06",112,0,6,"112 Years 0 Months 6 Days",null,"","","","",null,1951,2,6]
[null,"1951-03-06","1951-04-05","2012-03-06",65,null,null,"N/A","2012-03-06",112,2,6,"112 Years 2 Months 6 Days",null,"","","","",null,1951,3,6]
[null,"1951-04-06","1951-05-05","2012-05-06",65,null,null,"N/A","2012-05-06",112,4,6,"112 Years 4 Months 6 Days",null,"","","","",null,1951,4,6]
[null,"1951-05-06","1951-06-05","2012-07-06",65,null,null,"N/A","2012-07-06",112,6,6,"112 Years 6 Months 6 Days",null,"","","","",null,1951,5,6]
[null,"1951-06-06","1951-07-05","2012-09-06",65,null,null,"N/A","2012-09-06",112,8,6,"112 Years 8 Months 6 Days",null,"","","","",null,1951,6,6]
[null,"1951-07-06","1951-08-05","2012-11-06",65,null,null,"N/A","2012-11-06",112,10,6,"112 Years 10 Months 6 Days",null,"","","","",null,1951,7,6]
[null,"1951-08-06","1951-09-05","2013-01-06",65,null,null,"N/A","2013-01-06",113,0,6,"113 Years 0 Months 6 Days",null,"","","","",null,1951,8,6]
[null,"1951-09-06","1951-10-05","2013-03-06",65,null,null,"N/A","2013-03-06",113,2,6,"113 Years 2 Months 6 Days",null,"","","","",null,1951,9,6]
[null,"1951-10-06","1951-11-05","2013-05-06",65,null,null,"N/A","2013-05-06",113,4,6,"113 Years 4 Months 6 Days",null,"","","","",null,1951,10,6]
[null,"1951-11-06","1951-12-05","2013-07-06",65,null,null,"N/A","2013-07-06",113,6,6,"113 Years 6 Months 6 Days",null,"","","","",null,1951,11,6]
[null,"1951-12-06","1952-01-05","2013-09-06",65,null,null,"N/A","2013-09-06",113,8,6,"113 Years 8 Months 6 Days",null,"","","","",null,1951,12,6]
[null,"1952-01-06","1952-02-05","2013-11-06",65,null,null,"N/A","2013-11-06",113,10,6,"113 Years 10 Months 6 Days",null,"","","","",null,1952,1,6]
[null,"1952-02-06","1952-03-05","2014-01-06",65,null,null,"N/A","2014-01-06",114,0,6,"114 Years 0 Months 6 Days",null,"","","","",null,1952,2,6]
[null,"1952-03-06","1952-04-05","2014-03-06",65,null,null,"N/A","2014-03-06",114,2,6,"114 Years 2 Months 6 Days",null,"","","","",null,1952,3,6]
[null,"1952-04-06","1952-05-05","2014-05-06",65,null,null,"N/A","2014-05-06",114,4,6,"114 Years 4 Months 6 Days",null,"","","","",null,1952,4,6]
[null,"1952-05-06","1952-06-05","2014-07-06",65,null,null,"N/A","2014-07-06",114,6,6,"114 Years 6 Months 6 Days",null,"","","","",null,1952,5,6]
[null,"1952-06-06","1952-07-05","2014-09-06",65,null,null,"N/A","2014-09-06",114,8,6,"114 Years 8 Months 6 Days",null,"","","","",null,1952,6,6]
[null,"1952-07-06","1952-08-05","2014-11-06",65,null,null,"N/A","2014-11-06",114,10,6,"114 Years 10 Months 6 Days",null,"","","","",null,1952,7,6]
[null,"1952-08-06","1952-09-05","2015-01-06",65,null,null,"N/A","2015-01-06",115,0,6,"115 Years 0 Months 6 Days",null,"","","","",null,1952,8,6]
[null,"1952-09-06","1952-10-05","2015-03-06",65,null,null,"N/A","2015-03-06",115,2,6,"115 Years 2 Months 6 Days",null,"","","","",null,1952,9,6]
[null,"1952-10-06","1952-11-05","2015-05-06",65,null,null,"N/A","2015-05-06",115,4,6,"115 Years 4 Months 6 Days",null,"","","","",null,1952,10,6]
[null,"1952-11-06","1952-12-05","2015-07-06",65,null,null,{"$f":"IF(LEFT(LOWER(strSEX))=\"m\",IF(E66=\"\",\"Date\",\"Age\"), IF(LEFT(LOWER(strSEX))=\"f\",IF(F66=\"\",\"Date\",\"Age\"),\"N/A\"))","v":"N/A"},{"$f":"IF(H66=\"Age\",DATE(YEAR(dayDOB)+INT(IF(strSEX=\"Male\",E66,F66)),MONTH(dayDOB)+(IF(strSEX=\"Male\",(E66-INT(E66))*12,(F66-INT(F66))*12)),DAY(dayDOB)),D66)","v":"2015-07-06"},{"$f":"YEAR(DATE(YEAR(I66+0)-YEAR(dayDOB),MONTH(I66+0)-MONTH(dayDOB)+1,DAY(I66+0)-DAY(dayDOB)+1))-1900","v":115},{"$f":"MONTH(DATE(YEAR(I66+0)-YEAR(dayDOB),MONTH(I66+0)-MONTH(dayDOB)+1,DAY(I66+0)-DAY(dayDOB)+1))-1","v":6},{"$f":"I66-DATE(YEAR(dayDOB)+J66,MONTH(dayDOB)+K66,DAY(dayDOB))-0","v":6},{"$f":"J66&\" Years \"&K66\n&\" Months \"&L66&\" Days\"","v":"115 Years 6 Months 6 Days"},null,{"$f":"IF(AND(dayDOB>=B66,dayDOB<=C66),I66,\"\")","v":""},{"$f":"IF(O66<>\"\",J66,\"\")","v":""},{"$f":"IF(O66<>\"\",J66+K66/12,\"\")","v":""},{"$f":"IF(P66<>\"\",M66,\"\")","v":""},null,{"$f":"YEAR(B66)","v":1952},{"$f":"MONTH(B66)","v":11},{"$f":"DAY(B66)","v":6}]
[null,"1952-12-06","1953-01-05","2015-09-06",65,null,null,"N/A","2015-09-06",115,8,6,"115 Years 8 Months 6 Days",null,"","","","",null,1952,12,6]
[null,"1953-01-06","1953-02-05","2015-11-06",65,null,null,"N/A","2015-11-06",115,10,6,"115 Years 10 Months 6 Days",null,"","","","",null,1953,1,6]
[null,"1953-02-06","1953-03-05","2016-01-06",65,null,null,"N/A","2016-01-06",116,0,6,"116 Years 0 Months 6 Days",null,"","","","",null,1953,2,6]
[null,"1953-03-06","1953-04-05","2016-03-06",65,null,null,"N/A","2016-03-06",116,2,6,"116 Years 2 Months 6 Days",null,"","","","",null,1953,3,6]
[null,"1953-04-06","1953-05-05","2016-07-06",65,null,null,"N/A","2016-07-06",116,6,6,"116 Years 6 Months 6 Days",null,"","","","",null,1953,4,6]
[null,"1953-05-06","1953-06-05","2016-11-06",65,null,null,"N/A","2016-11-06",116,10,6,"116 Years 10 Months 6 Days",null,"","","","",null,1953,5,6]
[null,"1953-06-06","1953-07-05","2017-03-06",65,null,null,"N/A","2017-03-06",117,2,6,"117 Years 2 Months 6 Days",null,"","","","",null,1953,6,6]
[null,"1953-07-06","1953-08-05","2017-07-06",65,null,null,"N/A","2017-07-06",117,6,6,"117 Years 6 Months 6 Days",null,"","","","",null,1953,7,6]
[null,"1953-08-06","1953-09-05","2017-11-06",65,null,null,"N/A","2017-11-06",117,10,6,"117 Years 10 Months 6 Days",null,"","","","",null,1953,8,6]
[null,"1953-09-06","1953-10-05","2018-03-06",65,null,null,"N/A","2018-03-06",118,2,6,"118 Years 2 Months 6 Days",null,"","","","",null,1953,9,6]
[null,"1953-10-06","1953-11-05","2018-07-06",65,null,null,"N/A","2018-07-06",118,6,6,"118 Years 6 Months 6 Days",null,"","","","",null,1953,10,6]
[null,"1953-11-06","1953-12-05","2018-11-06",65,null,"XXX","N/A","2018-11-06",118,10,6,"118 Years 10 Months 6 Days",null,"","","","",null,1953,11,6]
[null,"1953-12-06","1954-01-05","2019-03-06",null,null,null,"N/A","2019-03-06",119,2,6,"119 Years 2 Months 6 Days",null,"","","","",null,1953,12,6]
[null,"1954-01-06","1954-02-05","2019-05-06",null,null,null,"N/A","2019-05-06",119,4,6,"119 Years 4 Months 6 Days",null,"","","","",null,1954,1,6]
[null,"1954-02-06","1954-03-05","2019-07-06",null,null,null,"N/A","2019-07-06",119,6,6,"119 Years 6 Months 6 Days",null,"","","","",null,1954,2,6]
[null,"1954-03-06","1954-04-05","2019-09-06",null,null,null,"N/A","2019-09-06",119,8,6,"119 Years 8 Months 6 Days",null,"","","","",null,1954,3,6]
[null,"1954-04-06","1954-05-05","2019-11-06",null,null,null,"N/A","2019-11-06",119,10,6,"119 Years 10 Months 6 Days",null,"","","","",null,1954,4,6]
[null,"1954-05-06","1954-06-05","2020-01-06",null,null,null,"N/A","2020-01-06",120,0,6,"120 Years 0 Months 6 Days",null,"","","","",null,1954,5,6]
[null,"1954-06-06","1954-07-05","2020-03-06",null,null,null,"N/A","2020-03-06",120,2,6,"120 Years 2 Months 6 Days",null,"","","","",null,1954,6,6]
[null,"1954-07-06","1954-08-05","2020-05-06",null,null,null,"N/A","2020-05-06",120,4,6,"120 Years 4 Months 6 Days",null,"","","","",null,1954,7,6]
[null,"1954-08-06","1954-09-05","2020-07-06",null,null,null,"N/A","2020-07-06",120,6,6,"120 Years 6 Months 6 Days",null,"","","","",null,1954,8,6]
[null,"1954-09-06","1954-10-05","2020-09-06",null,null,null,"N/A","2020-09-06",120,8,6,"120 Years 8 Months 6 Days",null,"","","","",null,1954,9,6]
[null,"1954-10-06","1960-04-05",null,66,66,null,"N/A","00:00:00",0,0,0,"0 Years 0 Months 0 Days",null,"","","","",null,1954,10,6]
[null,"1960-04-06","1960-05-05",null,66.083333333333329,66.083333333333329,null,"N/A","00:00:00",0,0,0,"0 Years 0 Months 0 Days",null,"","","","",null,1960,4,6]
[null,"1960-05-06","1960-06-05",null,66.166666666666671,66.166666666666671,null,"N/A","00:00:00",0,0,0,"0 Years 0 Months 0 Days",null,"","","","",null,1960,5,6]
[null,"1960-06-06","1960-07-05",null,66.25,66.25,null,"N/A","00:00:00",0,{"$f":"MONTH(DATE(YEAR(I92+0)-YEAR(dayDOB),MONTH(I92+0)-MONTH(dayDOB)+1,DAY(I92+0)-DAY(dayDOB)+1))-1","v":"00:00:00"},0,"0 Years 0 Months 0 Days",null,"","","","",null,1960,6,6]
[null,"1960-07-06","1960-07-30",null,66.3333333333333,66.333333333333329,null,"N/A","00:00:00",0,0,0,"0 Years 0 Months 0 Days",null,"","","","",null,1960,7,6]
[null,"1960-07-31","1960-07-31","2026-11-30",null,null,null,"N/A","2026-11-30",66,4,0,"66 Years 4 Months 0 Days",null,"","","","",null,1960,7,31]
[null,"1960-08-01","1960-08-05",null,66.333333333333329,66.333333333333329,null,"N/A","00:00:00",{"$f":"YEAR(DATE(YEAR(I95+0)-YEAR(dayDOB),MONTH(I95+0)-MONTH(dayDOB)+1,DAY(I95+0)-DAY(dayDOB)+1))-1900","v":0},{"$f":"MONTH(DATE(YEAR(I95+0)-YEAR(dayDOB),MONTH(I95+0)-MONTH(dayDOB)+1,DAY(I95+0)-DAY(dayDOB)+1))-1","v":0},{"$f":"I95-DATE(YEAR(dayDOB)+J95,MONTH(dayDOB)+K95,DAY(dayDOB))-0","v":0},"0 Years 0 Months 0 Days",null,"","","","",null,1960,8,1]
[null,"1960-08-06","1960-09-05",null,66.416666666666671,66.416666666666671,null,"N/A","00:00:00",0,0,0,"0 Years 0 Months 0 Days",null,"","","","",null,1960,8,6]
[null,"1960-09-06","1960-10-05",null,66.5,66.5,null,"N/A","00:00:00",0,0,0,"0 Years 0 Months 0 Days",null,"","","","",null,1960,9,6]
[null,"1960-10-06","1960-11-05",null,66.583333333333329,66.583333333333329,null,{"$f":"IF(LEFT(LOWER(strSEX))=\"m\",IF(E98=\"\",\"Date\",\"Age\"), IF(LEFT(LOWER(strSEX))=\"f\",IF(F98=\"\",\"Date\",\"Age\"),\"N/A\"))","v":"N/A"},{"$f":"IF(H98=\"Age\",DATE(YEAR(dayDOB)+INT(IF(strSEX=\"Male\",E98,F98)),MONTH(dayDOB)+(IF(strSEX=\"Male\",(E98-INT(E98))*12,(F98-INT(F98))*12)),DAY(dayDOB)),D98)","v":"00:00:00"},0,0,0,{"$f":"J98&\" Years \"&K98\n&\" Months \"&L98&\" Days\"","v":"0 Years 0 Months 0 Days"},null,{"$f":"IF(AND(dayDOB>=B98,dayDOB<=C98),I98,\"\")","v":""},{"$f":"IF(O98<>\"\",J98,\"\")","v":""},{"$f":"IF(O98<>\"\",J98+K98/12,\"\")","v":""},{"$f":"IF(P98<>\"\",M98,\"\")","v":""},null,{"$f":"YEAR(B98)","v":1960},{"$f":"MONTH(B98)","v":10},{"$f":"DAY(B98)","v":6}]
[null,"1960-11-06","1960-12-05",null,66.666666666666671,66.666666666666671,null,"N/A","00:00:00",0,0,0,"0 Years 0 Months 0 Days",null,"","","","",null,1960,11,6]
[null,"1960-12-06","1960-12-30",null,66.75,66.75,null,"N/A","00:00:00",0,0,0,"0 Years 0 Months 0 Days",null,"","","","",null,1960,12,6]
[null,"1960-12-31","1960-12-31","2027-09-30",null,null,null,"N/A","2027-09-30",66,9,0,"66 Years 9 Months 0 Days",null,"","","","",null,1960,12,31]
[null,"1961-01-01","1961-01-05",null,66.75,66.75,null,"N/A","00:00:00",{"$f":"YEAR(DATE(YEAR(I102+0)-YEAR(dayDOB),MONTH(I102+0)-MONTH(dayDOB)+1,DAY(I102+0)-DAY(dayDOB)+1))-1900","v":0},{"$f":"MONTH(DATE(YEAR(I102+0)-YEAR(dayDOB),MONTH(I102+0)-MONTH(dayDOB)+1,DAY(I102+0)-DAY(dayDOB)+1))-1","v":0},{"$f":"I102-DATE(YEAR(dayDOB)+J102,MONTH(dayDOB)+K102,DAY(dayDOB))-0","v":0},"0 Years 0 Months 0 Days",null,"","","","",null,1961,1,1]
[null,"1961-01-06","1961-01-30",null,66.833333333333329,66.833333333333329,null,"N/A","00:00:00",{"$f":"YEAR(DATE(YEAR(I103+0)-YEAR(dayDOB),MONTH(I103+0)-MONTH(dayDOB)+1,DAY(I103+0)-DAY(dayDOB)+1))-1900","v":0},{"$f":"MONTH(DATE(YEAR(I103+0)-YEAR(dayDOB),MONTH(I103+0)-MONTH(dayDOB)+1,DAY(I103+0)-DAY(dayDOB)+1))-1","v":0},{"$f":"I103-DATE(YEAR(dayDOB)+J103,MONTH(dayDOB)+K103,DAY(dayDOB))-0","v":0},"0 Years 0 Months 0 Days",null,"","","","",null,1961,1,6]
[null,"1961-01-31","1961-01-31","2027-11-30",null,null,null,"N/A","2027-11-30",66,10,0,"66 Years 10 Months 0 Days",null,"","","","",null,1961,1,31]
[null,"1961-02-01","1961-02-05",null,66.833333333333329,66.833333333333329,null,"N/A","00:00:00",{"$f":"YEAR(DATE(YEAR(I105+0)-YEAR(dayDOB),MONTH(I105+0)-MONTH(dayDOB)+1,DAY(I105+0)-DAY(dayDOB)+1))-1900","v":0},{"$f":"MONTH(DATE(YEAR(I105+0)-YEAR(dayDOB),MONTH(I105+0)-MONTH(dayDOB)+1,DAY(I105+0)-DAY(dayDOB)+1))-1","v":0},{"$f":"I105-DATE(YEAR(dayDOB)+J105,MONTH(dayDOB)+K105,DAY(dayDOB))-0","v":0},"0 Years 0 Months 0 Days",null,"","","","",null,1961,2,1]
[null,"1961-02-06","1961-03-05",null,66.916666666666671,66.916666666666671,null,"N/A","00:00:00",0,0,0,"0 Years 0 Months 0 Days",null,"","","","",null,1961,2,6]
[null,"1961-03-06","1961-04-05",null,67,67,null,"N/A","00:00:00",0,0,0,"0 Years 0 Months 0 Days",null,"","","","",null,1961,3,6]
[null,"1961-04-06","1969-04-05",null,67,67,null,"N/A","00:00:00",0,0,0,"0 Years 0 Months 0 Days",null,"","","","",null,1961,4,6]
[null,"1969-04-06","1977-04-05",null,67,67,null,"N/A","00:00:00",0,0,0,"0 Years 0 Months 0 Days",null,"","","","",null,1969,4,6]
[null,"1977-04-06","1977-05-05","2044-05-06",null,null,null,"N/A","2044-05-06",144,4,6,"144 Years 4 Months 6 Days",null,"","","","",null,1977,4,6]
[null,"1977-05-06","1977-06-05","2044-07-06",null,null,null,"N/A","2044-07-06",144,6,6,"144 Years 6 Months 6 Days",null,"","","","",null,1977,5,6]
[null,"1977-06-06","1977-07-05","2044-09-06",null,null,null,"N/A","2044-09-06",144,8,6,"144 Years 8 Months 6 Days",null,"","","","",null,1977,6,6]
[null,"1977-07-06","1977-08-05","2044-11-06",null,null,null,"N/A","2044-11-06",144,10,6,"144 Years 10 Months 6 Days",null,"","","","",null,1977,7,6]
[null,"1977-08-06","1977-09-05","2045-01-06",null,null,null,"N/A","2045-01-06",145,0,6,"145 Years 0 Months 6 Days",null,"","","","",null,1977,8,6]
[null,"1977-09-06","1977-10-05","2045-03-06",null,null,null,"N/A","2045-03-06",145,2,6,"145 Years 2 Months 6 Days",null,"","","","",null,1977,9,6]
[null,"1977-10-06","1977-11-05","2045-05-06",null,null,null,"N/A","2045-05-06",145,4,6,"145 Years 4 Months 6 Days",null,"","","","",null,1977,10,6]
[null,"1977-11-06","1977-12-05","2045-07-06",null,null,null,"N/A","2045-07-06",145,6,6,"145 Years 6 Months 6 Days",null,"","","","",null,1977,11,6]
[null,"1977-12-06","1978-01-05","2045-09-06",null,null,null,"N/A","2045-09-06",145,8,6,"145 Years 8 Months 6 Days",null,"","","","",null,1977,12,6]
[null,"1978-01-06","1978-02-05","2045-11-06",null,null,null,"N/A","2045-11-06",145,10,6,"145 Years 10 Months 6 Days",null,"","","","",null,1978,1,6]
[null,"1978-02-06","1978-03-05","2046-01-06",null,null,null,"N/A","2046-01-06",146,0,6,"146 Years 0 Months 6 Days",null,"","","","",null,1978,2,6]
[null,"1978-03-06","1978-04-05","2046-03-06",null,null,null,"N/A","2046-03-06",146,2,6,"146 Years 2 Months 6 Days",null,"","","","",null,1978,3,6]
[null,"1978-04-06","2999-12-31",null,68,68,null,"N/A","00:00:00",0,0,0,"0 Years 0 Months 0 Days",null,"","","","",null,1978,4,6]
[]
[]
[null,null,null,null,null,null,null,null,{"$f":"IF(H125=\"Age\",DATE(YEAR(dayDOB)+IF(strSEX=\"Male\",E125,F125),MONTH(dayDOB),DAY(dayDOB)),D125)","v":"00:00:00"}]
[null,null,null,null,null,null,null,null,"00:00:00"]
[null,null,null,null,null,null,null,null,"00:00:00"]
[null,null,null,null,null,null,null,null,"00:00:00"]
[null,null,null,null,null,null,null,null,"00:00:00"]
[null,null,null,null,null,null,null,null,"00:00:00"]
[null,null,null,null,null,null,null,null,"00:00:00"]
[null,null,null,null,null,null,null,null,"00:00:00"]
[null,null,null,null,null,null,null,null,"00:00:00"]
[null,null,null,null,null,null,null,null,"00:00:00"]
[null,null,null,null,null,null,null,null,"00:00:00"]
[null,null,null,null,null,null,null,null,"00:00:00"]
[null,null,null,null,null,null,null,null,"00:00:00"]
[null,null,null,null,null,null,null,null,"00:00:00"]
[null,null,null,null,null,null,null,null,"00:00:00"]
[null,null,null,null,null,null,null,null,"00:00:00"]
[null,null,null,null,null,null,null,null,"00:00:00"]
[null,null,null,null,null,null,null,null,"00:00:00"]
[null,null,null,null,null,null,null,null,"00:00:00"]
[null,null,null,null,null,null,null,null,"00:00:00"]
[null,null,null,null,null,null,null,null,"00:00:00"]
[null,null,null,null,null,null,null,null,"00:00:00"]
[null,null,null,null,null,null,null,null,"00:00:00"]
[null,null,null,null,null,null,null,null,"00:00:00"]
[null,null,null,null,null,null,null,null,"00:00:00"]
[null,null,null,null,null,null,null,null,"00:00:00"]
[null,null,null,null,null,null,null,null,"00:00:00"]
[null,null,null,null,null,null,null,null,"00:00:00"]
[null,null,null,null,null,null,null,null,"00:00:00"]
[null,null,null,null,null,null,null,null,"00:00:00"]
[null,null,null,null,null,null,null,null,"00:00:00"]
[null,null,null,null,null,null,null,null,"00:00:00"]
[null,null,null,null,null,null,null,null,{"$f":"IF(H157=\"Age\",DATE(YEAR(dayDOB)+IF(strSEX=\"Male\",E157,F157),MONTH(dayDOB),DAY(dayDOB)),D157)","v":"00:00:00"}]
[null,null,null,null,null,null,null,null,"00:00:00"]
[null,null,null,null,null,null,null,null,"00:00:00"]
[null,null,null,null,null,null,null,null,"00:00:00"]
[null,null,null,null,null,null,null,null,"00:00:00"]
[null,null,null,null,null,null,null,null,"00:00:00"]
[null,null,null,null,null,null,null,null,"00:00:00"]
[null,null,null,null,null,null,null,null,"00:00:00"]
[null,null,null,null,null,null,null,null,"00:00:00"]
[null,null,null,null,null,null,null,null,"00:00:00"]
[null,null,null,null,null,null,null,null,"00:00:00"]
[null,null,null,null,null,null,null,null,"00:00:00"]
[null,null,null,null,null,null,null,null,"00:00:00"]
[null,null,null,null,null,null,null,null,"00:00:00"]
[null,null,null,null,null,null,null,null,"00:00:00"]
[null,null,null,null,null,null,null,null,"00:00:00"]
[null,null,null,null,null,null,null,null,"00:00:00"]
[null,null,null,null,null,null,null,null,"00:00:00"]
[null,null,null,null,null,null,null,null,"00:00:00"]
[null,null,null,null,null,null,null,null,"00:00:00"]
[null,null,null,null,null,null,null,null,"00:00:00"]
[null,null,null,null,null,null,null,null,"00:00:00"]
[null,null,null,null,null,null,null,null,"00:00:00"]
[null,null,null,null,null,null,null,null,"00:00:00"]
[null,null,null,null,null,null,null,null,"00:00:00"]
[]
[]
[]
[]
[]
[]
[]
[]
[]
[]
[]
[]
[]
[]
[]
[]
[]
[]
[]
[]
[]
[]
[]
[null,null,"CSCS - Errors and Messages"]
[]
[]
[null,"Error and other messages"]
[null,"General"]
[null,{"$f":"\"SPA ERROR :\"&IF(bSexError,_errSex,\"\")&IF(_errExpiration,\"\")&IF(bDOBError,_errDOB,\"\")","v":"SPA ERROR :Sex IncorrectFALSEDOB Incorrect"},null,null,null,null,null,null,"_errOverall"]
[null,{"$f":"\"Calculation Date :\" &TEXT(NOW(),\"hh:mm,  dd mmm yyyy \")&\".  \"","v":"Calculation Date :08:08,  16 Jun 2022 .  "},null,null,null,null,null,null,"msgPrint"]
[null,"This SPA tool is based on the following in force Pensions Acts  95, 2007, 2011, 2014.",null,null,null,null,null,null,"msgCaveats"]
[null,{"$f":"IF(bDOBError,\"DOB Incorrect\",\"\")","v":"DOB Incorrect"},null,null,null,null,null,null,"_errDOB"]
[null,{"$f":"IF(bDOBError,\"Sex Incorrect\",\"\")","v":"Sex Incorrect"},null,null,null,null,null,null,"_errSex"]
[]
[]
[null,null,{"$f":"$C$1&\" - Error Checking\"","v":"SPD - Error Checking"}]
[]
[]
[null,"Error Checking"]
[null,"Sex Error (FALSE=OK)",{"$f":"IF(OR(LEFT(LOWER(strSEX))=\"m\",LEFT(LOWER(strSEX))=\"f\"),FALSE,TRUE)","v":true},"bSexError"]
[null,"DOB Error  (FALSE=OK)",{"$f":"IF(OR(dayDOB<DATE(1900,1,1),dayDOB>DATE(2900,12,31)),TRUE,FALSE)","v":true},"bDOBError"]

{"sheet":"PresenceCheck_Calculations","index":4,"n_rows":91,"n_cols":19,"rows_kept":91,"cut":false,"hidden":true,"merged":[[5,2,5,9],[3,2,3,8],[4,2,4,8]]}
[null,null,"(Admin View) Taper/PS/CS Calculations"]
[]
[]
[null,"Description","This sheet is used to establish the member's presences at 1/4/2012 and Taper Status"]
[null,"Schemes","NA"]
[null,null,"Exceptions :  TV Ins, TV Outs, Partial/Full Retirement, Machinery of Government, ROC [TBC]"]
[]
[]
[null,null,{"$f":"$C$1&\" - Inputs\"","v":"(Admin View) Taper/PS/CS Calculations - Inputs"}]
[]
[null,"NOT USED : Initial Eligibility, Have rights been extinguished?",null,null,"Error?"]
[null,"Have you had a transfer out?","No","strTVOut",{"$f":"IF(strTVOut=\"Yes\",TRUE,FALSE)","v":false},"bTVOut"]
[null,"Have you had a transfer in?","No","strTVIn",{"$f":"IF(strTVIn=\"Yes\",TRUE,FALSE)","v":false},"bTVIn"]
[null,"Have you had a return of contributions?","No","strROC",{"$f":"IF(strROC=\"Yes\",TRUE,FALSE)","v":false},"bROC"]
[null,"Have you been subject to Machinery of Government","No","strMoG",{"$f":"IF(strMoG=\"Yes\",TRUE,FALSE)","v":false},"bMoG"]
[null,"Have you taken partial retirement?","No","strPartialRet",{"$f":"IF(strPartialRet=\"Yes\",TRUE,FALSE)","v":false},"bPartialRet"]
[null,"Have you taken full retirement?","No","strFullRet",{"$f":"IF(strFullRet=\"Yes\",TRUE,FALSE)","v":false},"bFullRet"]
[]
[]
[]
[null,"You may still be eligible for a deferred pension however you circumstances and history require further review."]
[]
[null,"Work History"]
[null,"Earnings"]
[null,"Assuming: each period of service you have eligibility to a deferred pension"]
[null,null,"Start Date","End Date","Employment Type","Message/Error","Error","Start Date","End Date","Service","31/3/2012?",null,"31/3/2015?","Period of PS ","Period of Cs","Period of Other/Break","Service in period of Other","Is break qualifying at 2012? <5 years","Is break qualifying at 2015? <5 years"]
[null,"Pension Period 01",{"$f":"INDEX(uitabPensionHistory,RIGHT(B27,2),1)","v":"00:00:00"},{"$f":"IF(INDEX(uitabPensionHistory,RIGHT(B27,2),2)=\"\",\"\",INDEX(uitabPensionHistory,RIGHT(B27,2),2))","v":""},{"$f":"IF(INDEX(uitabPensionHistory,RIGHT(B27,2),6)=\"\",\"\",INDEX(uitabPensionHistory,RIGHT(B27,2),6))","v":""},{"$f":"IF(K27<>\"\",\"(2012) \",\"\")&IF(M27<>\"\",\"(2015) \",\"\")&IF(AND(D27<>\"\",D27<C27),\"Check Dates\",IF(AND(C27<>\"\",E27=\"\"),\"Enter Employment Type\",IF(AND(C27=\"\",E27<>\"\"),\"Check Dates\",\"\")))","v":"Enter Employment Type"},{"$f":"IF(F27<>\"\",IF(OR(LEFT(F27,6)=\"(2012)\",LEFT(F27,6)=\"(2015)\"),FALSE,TRUE),FALSE)","v":true},{"$f":"IF(C27=\"\",StartDate,C27)","v":"00:00:00"},{"$f":"IF(D27=\"\",StartDate,D27)","v":"00:00:00"},{"$f":"YEARFRAC(H27,I27,1)","v":0},{"$f":"IF(AND(day2012_>=H27,day2012_<=I27),E27,\"\")","v":""},null,{"$f":"IF(AND(day2015_>=H27,day2015_<=I27),E27,\"\")","v":""},{"$f":"IF(E27<>\"public\",0,1)","v":0},{"$f":"IF(E27<>\"civil\",0,1)","v":0},{"$f":"IF(E27<>\"other\",0,1)","v":0},{"$f":"IF(P27>0,SUMIF($P$27:$P$36,P27,$J$27:$J$36),0)","v":0},{"$f":"IF(AND(K27<>\"\",OR($G$27:$G$36)),\"NA\",IF(K27=\"Other\",IF(Q27>5,\"B\",\"QB\"),K27))","v":""},{"$f":"IF(AND(M27<>\"\",OR($G$27:$G$36)),\"NA\",IF(M27=\"Other\",IF(Q27>5,\"B\",\"QB\"),M27))","v":""}]
[null,"Pension Period 02","","","","",{"$f":"IF(F28<>\"\",IF(OR(LEFT(F28,6)=\"(2012)\",LEFT(F28,6)=\"(2015)\"),FALSE,TRUE),FALSE)","v":false},"00:00:00","00:00:00",0,"",null,"",{"$f":"IF(E28<>\"public\",0,IF(E28=E27,MAX(N$27:N27),MAX(N$27:N27)+1))","v":0},{"$f":"IF(E28<>\"civil\",0,IF(E28=E27,MAX(O$27:O27),MAX(O$27:O27)+1))","v":0},{"$f":"IF(E28<>\"other\",0,IF(E28=E27,MAX(P$27:P27),MAX(P$27:P27)+1))","v":0},0,{"$f":"IF(AND(K28<>\"\",OR($G$27:$G$36)),\"NA\",IF(K28=\"Other\",IF(Q28>5,\"B\",\"QB\"),K28))","v":""},{"$f":"IF(AND(M28<>\"\",OR($G$27:$G$36)),\"NA\",IF(M28=\"Other\",IF(Q28>5,\"B\",\"QB\"),M28))","v":""}]
[null,"Pension Period 03","","","","",false,"00:00:00","00:00:00",0,"",null,"",{"$f":"IF(E29<>\"public\",0,IF(E29=E28,MAX(N$27:N28),MAX(N$27:N28)+1))","v":0},{"$f":"IF(E29<>\"civil\",0,IF(E29=E28,MAX(O$27:O28),MAX(O$27:O28)+1))","v":0},{"$f":"IF(E29<>\"other\",0,IF(E29=E28,MAX(P$27:P28),MAX(P$27:P28)+1))","v":0},{"$f":"IF(P29>0,SUMIF($P$27:$P$36,P29,$J$27:$J$36),0)","v":0},{"$f":"IF(AND(K29<>\"\",OR($G$27:$G$36)),\"NA\",IF(K29=\"Other\",IF(Q29>5,\"B\",\"QB\"),K29))","v":""},""]
[null,"Pension Period 04","","","","",false,"00:00:00","00:00:00",0,"",null,"",{"$f":"IF(E30<>\"public\",0,IF(E30=E29,MAX(N$27:N29),MAX(N$27:N29)+1))","v":0},{"$f":"IF(E30<>\"civil\",0,IF(E30=E29,MAX(O$27:O29),MAX(O$27:O29)+1))","v":0},{"$f":"IF(E30<>\"other\",0,IF(E30=E29,MAX(P$27:P29),MAX(P$27:P29)+1))","v":0},0,{"$f":"IF(AND(K30<>\"\",OR($G$27:$G$36)),\"NA\",IF(K30=\"Other\",IF(Q30>5,\"B\",\"QB\"),K30))","v":""},""]
[null,"Pension Period 05","","","","",false,"00:00:00","00:00:00",0,"",null,"",{"$f":"IF(E31<>\"public\",0,IF(E31=E30,MAX(N$27:N30),MAX(N$27:N30)+1))","v":0},{"$f":"IF(E31<>\"civil\",0,IF(E31=E30,MAX(O$27:O30),MAX(O$27:O30)+1))","v":0},{"$f":"IF(E31<>\"other\",0,IF(E31=E30,MAX(P$27:P30),MAX(P$27:P30)+1))","v":0},0,{"$f":"IF(AND(K31<>\"\",OR($G$27:$G$36)),\"NA\",IF(K31=\"Other\",IF(Q31>5,\"B\",\"QB\"),K31))","v":""},""]
[null,"Pension Period 06","","","","",false,"00:00:00","00:00:00",0,"",null,"",{"$f":"IF(E32<>\"public\",0,IF(E32=E31,MAX(N$27:N31),MAX(N$27:N31)+1))","v":0},{"$f":"IF(E32<>\"civil\",0,IF(E32=E31,MAX(O$27:O31),MAX(O$27:O31)+1))","v":0},{"$f":"IF(E32<>\"other\",0,IF(E32=E31,MAX(P$27:P31),MAX(P$27:P31)+1))","v":0},0,{"$f":"IF(AND(K32<>\"\",OR($G$27:$G$36)),\"NA\",IF(K32=\"Other\",IF(Q32>5,\"B\",\"QB\"),K32))","v":""},""]
[null,"Pension Period 07","","","","",false,"00:00:00","00:00:00",0,"",null,"",{"$f":"IF(E33<>\"public\",0,IF(E33=E32,MAX(N$27:N32),MAX(N$27:N32)+1))","v":0},{"$f":"IF(E33<>\"civil\",0,IF(E33=E32,MAX(O$27:O32),MAX(O$27:O32)+1))","v":0},{"$f":"IF(E33<>\"other\",0,IF(E33=E32,MAX(P$27:P32),MAX(P$27:P32)+1))","v":0},0,"",""]
[null,"Pension Period 08","","","","",false,"00:00:00","00:00:00",0,"",null,"",{"$f":"IF(E34<>\"public\",0,IF(E34=E33,MAX(N$27:N33),MAX(N$27:N33)+1))","v":0},{"$f":"IF(E34<>\"civil\",0,IF(E34=E33,MAX(O$27:O33),MAX(O$27:O33)+1))","v":0},{"$f":"IF(E34<>\"other\",0,IF(E34=E33,MAX(P$27:P33),MAX(P$27:P33)+1))","v":0},0,"",""]
[null,"Pension Period 09","","","","",false,"00:00:00","00:00:00",0,"",null,"",{"$f":"IF(E35<>\"public\",0,IF(E35=E34,MAX(N$27:N34),MAX(N$27:N34)+1))","v":0},{"$f":"IF(E35<>\"civil\",0,IF(E35=E34,MAX(O$27:O34),MAX(O$27:O34)+1))","v":0},{"$f":"IF(E35<>\"other\",0,IF(E35=E34,MAX(P$27:P34),MAX(P$27:P34)+1))","v":0},0,"",""]
[null,"Pension Period 10","","","","",false,"00:00:00","00:00:00",0,"",null,"",{"$f":"IF(E36<>\"public\",0,IF(E36=E35,MAX(N$27:N35),MAX(N$27:N35)+1))","v":0},{"$f":"IF(E36<>\"civil\",0,IF(E36=E35,MAX(O$27:O35),MAX(O$27:O35)+1))","v":0},{"$f":"IF(E36<>\"other\",0,IF(E36=E35,MAX(P$27:P35),MAX(P$27:P35)+1))","v":0},0,"",""]
[null,null,null,null,"* Post 31/3/2015",null,"tabPCErrors",null,null,{"$f":"SUM(J27:J36)","v":0}]
[]
[null,"Eligibility based on employment at 2015 and 2012"]
[null,"IF PS and PS or PS and CS or CS and PS or PS and PS - > Eligible"]
[null,"Status at 2012",{"$f":"CONCATENATE(K27,K28,K29,K30,K31,K32,K33,K34,K35,K36)","v":""},"strStatus2012"]
[null,"Status at 2015",{"$f":"CONCATENATE(M27,M28,M29,M30,M31,M32,M33,M34,M35,M36)","v":""},"strStatus2015"]
[null,"Eligibility based on employment at 2015 and 2012 (True = Eligible)",{"$f":"IF(OR(strStatus2012=\"\",strStatus2015=\"\"),FALSE,TRUE)","v":false},"bEligEmployment"]
[]
[]
[null,"If 2015 or 2012 was a break - was it eligible?"]
[null,"if OTHER then check status, B = BREAK, QB = QualBreak"]
[null,"Break Status at 2012, ",{"$f":"CONCATENATE(R27,R28,R29,R30,R31,R32,R33,R35,R34,R36)","v":""},"strBreakStatus2012",null,{"$f":"IF(strBreakStatus2012=\"B\",\"Non Qualifying Break\",IF(strBreakStatus2012=\"QB\",\"Qualifying Break\",IF(strBreakStatus2012=\"NA\",\"Enter Service to new start date\",\"In Scheme\")))","v":"In Scheme"},"strBreakStatusFull2012"]
[null,"Break Status at 2015",{"$f":"CONCATENATE(S27,S28,S29,S30,S31,S32,S33,S34,S35,S36)","v":""},"strBreakBtatus2015",null,{"$f":"IF(strBreakStatus2015=\"B\",\"Non Qualifying Break\",IF(strBreakStatus2015=\"QB\",\"Qualifying Break\",IF(strBreakStatus2015=\"NA\",\"Enter Service to new start date\",\"In Scheme\")))","v":"In Scheme"},"strBreakStatusFull2015"]
[null,"Eligibility based on employment at 2015 and 2012 (True = Eligible)",{"$f":"IF(bEligEmployment,IF(OR(strBreakStatus2012=\"B\",strBreakStatus2015=\"B\"),FALSE,TRUE))","v":false},"bEligBreak"]
[null,"Message",{"$f":"IF(bEligEmployment,IF(AND(strBreakStatus2012=\"B\",strBreakStatus2015=\"B\"),\"Member was on a non-qualifying breaks in service on 1/4/2012 and 1/4/2015.  \",IF(AND(strBreakStatus2012=\"B\"),\"Member was on a non qualifying break in service on 1/4/2012.  \",IF(AND(strBreakStatus2012=\"B\"),\"Member had a non qualifying break in service on 1/4/2012.  \",\"\"))),\"\")","v":""},"msgEligBreak"]
[]
[]
[]
[null,"Protection status"]
[null,"Establish the scheme they were/would have been in at the 2012 date :"]
[]
[null,"If they were in civil service what scheme were they in?",{"$f":"CSScheme","v":0}]
[null,"Civil service NPA",{"$f":"resPrevSchemeNPACS","v":""},"iUserCivilNPA2012"]
[null,"If they were in public service what was their NPA?",{"$f":"PSNPA","v":65},"iUserPublicNPA2012",null,"Assumptions"]
[null,"If they were on a break/other what is their assumed NPA?",{"$f":"OSNPA","v":65},"iUserOtherNPA2012"]
[]
[null,"NPA of scheme at 1/4/2012",{"$f":"IF(strStatus2012=INDEX(tabEmploymentType,1),iUserCivilNPA2012,IF(strStatus2012=INDEX(tabEmploymentType,2),iUserPubliclNPA2012,iUserOtherNPA2012))","v":""},"iNPAFromSourceScheme"]
[]
[]
[null,"Initial; Analysis"]
[null,"Age at 2012",{"$f":"dAge2012","v":112.25256220773872}]
[null,"More than 13.5 years to NPA @ 2012",{"$f":"IF(ISNUMBER(iNPAFromSourceScheme),IF(iNPAFromSourceScheme-dAge2012>13.5,TRUE,FALSE),\"\")","v":""},"bNoProtection"]
[null,"Less than equal to 10 years to NPA @ 2012",{"$f":"IF(ISNUMBER(iNPAFromSourceScheme),IF(iNPAFromSourceScheme-dAge2012<=10,TRUE,FALSE),\"\")","v":""},"bFullyProtected"]
[null,"Tapered?",{"$f":"IF(ISNUMBER(iNPAFromSourceScheme),IF(AND(C68=FALSE,C69=FALSE),TRUE,FALSE),\"\")","v":""},"bTapered"]
[]
[null,"Tapered analysis (NPA = iNPAFromSourceScheme)"]
[null,"Complete month to NPA",{"$f":"IF(ISNUMBER(iToNPAAt2012Years*12+iToNPAAt2012Months),iToNPAAt2012Years*12+iToNPAAt2012Months,\"\")","v":""},"MonthsToNPA"]
[null,"TE End Date To NPA iNPAFromSourceScheme",{"$f":"IF(MonthsToNPA>=162,DATE(2015,4,1),IF(ISNA(VLOOKUP(iToNPAAt2012Years*12+iToNPAAt2012Months,tabProtection2,FALSE,0)),DATE(2099,12,31),VLOOKUP(MonthsToNPA,tabProtection2,3,FALSE)))","v":"2015-04-01"},"TEDateNPA"]
[]
[]
[null,null,{"$f":"$C$1&\" - Calculations\"","v":"(Admin View) Taper/PS/CS Calculations - Calculations"}]
[]
[null,"Rejoiner calculations"]
[null,"Age today, double",{"$f":"YEARFRAC(uiDOB,dayToday+0,1)","v":122.46063439065108},"dAgeToday"]
[null,"Age today, integer",{"$f":"INT(dAgeToday)","v":122},"iAgeToday"]
[null,"NPD Based on scheme NPA",{"$f":"MAX(resdaySPD,DATE(YEAR(uiDOB)+65,MONTH(uiDOB),DAY(uiDOB)))","v":"1964-12-31"},"dayNPD"]
[null,"Age today, integer",{"$f":"YEARFRAC(uiDOB,dayNPD+0,1)","v":65.002737879617541},"dAgeNPA"]
[null,"Age @ 2012",{"$f":"YEARFRAC(uiDOB,day2012_+1,1)","v":112.25256220773872},"dAge2012"]
[null,"Age : Complete Years@ 2012",{"$f":"DATEDIF(uiDOB,day2012_+1, \"Y\")","v":112},"iAge2012Years"]
[null,"Age : Remainder Months @ 2012",{"$f":"DATEDIF(uiDOB,day2012_+1, \"YM\")","v":3},"iAge2012Months"]
[null,"Age : Remainder Days @ 2012",{"$f":"DATEDIF(uiDOB,day2012_+1, \"MD\")","v":1},"iAge2012Days"]
[null,"Age @ 2012",{"$f":"CONCATENATE(iAge2012Years,\" years and \",iAge2012Months,\" months and \",iAge2012Days,\" days\")","v":"112 years and 3 months and 1 days"}]
[]
[null,"Service to NPA Scheme NPA @ 2012",{"$f":"IF(ISNUMBER(iNPAFromSourceScheme),ROUNDDOWN(SUM((iNPAFromSourceScheme*12)-DATEDIF(uiDOB,day2012_+1, \"M\"))/12,0),\"\")","v":""},"iToNPAAt2012Years"]
[null,"Service to NPA NPA Scheme NPA @ 2012 Remainder Months",{"$f":"IF(ISNUMBER(iNPAFromSourceScheme),SUM((iNPAFromSourceScheme*12)-DATEDIF(uiDOB,day2012_+1,\"M\"))-(iToNPAAt2012Years*12),\"\")","v":""},"iToNPAAt2012Months"]

{"sheet":"System Calcs,Assump,Table_hide","index":5,"n_rows":125,"n_cols":9,"rows_kept":125,"cut":false,"hidden":true,"merged":[[3,2,3,6],[4,2,4,6]]}
[null,null,{"$f":"strToolName& \" (Admin view) joiner - Global tables, assumptions, errors\"","v":"Joiner Tool (Admin view) joiner - Global tables, assumptions, errors"}]
[]
[]
[null,"Description","This calculator is used to determine the which scheme and pack should be sent to a CSP joiner.  This sheet is intended to be used by ADMINISTRATION staff as a backend tool.  It is not expected that this will be exposed to the public users."]
[null,"Schemes","Classic, Classic Plus, Premium, nuvos, alpha"]
[]
[]
[]
[null,null,{"$f":"$C$1&\" - Error Checking\"","v":"Joiner Tool (Admin view) joiner - Global tables, assumptions, errors - Error Checking"}]
[]
[]
[null,"Error Checking"]
[]
[null,"Errors",null,null,"Error Messages"]
[null,"Questionnaire inputs error (FALSE=OK)",{"$f":"IF(uiErrorCount>0,TRUE,FALSE)","v":true},"bInputsError","Check Error Messages (Red Text)","errInputsError"]
[null,"SPA errors (FALSE=OK)",{"$f":"OR(bSexError,'SPD Calculations_Hide'!bDOBError)","v":true},"bSPAErrors","Check Sex or DOB","errSPA"]
[null,"Expiration (FALSE=OK)",{"$f":"IF(dayExpiry<dayToday,TRUE,FALSE)","v":false},"bExpiryError",{"$f":"\"Tool Expired on \"&TEXT(dayExpiry,\"dd/mm/yyyy\")&\" please contact MyCSP for a new copy. \"","v":"Tool Expired on 01/04/2023 please contact MyCSP for a new copy. "},"_errExpiration"]
[null,"Version (FALSE=OK)",{"$f":"IF(VersionNumber<>MAX(tabVersionRange),TRUE,FALSE)","v":false},"bVersionError","Check Version Number.","_errVersion"]
[]
[null,"Service table error  (FALSE=OK)",{"$f":"IF(AND(PrevMemCS=\"N\",PrevMemPS=\"N\"),FALSE,IF(OR(tabPCErrors),TRUE,FALSE))","v":true},"bServiceTableError","Check Service Table","errServiceTableError"]
[null,"Overall Error (FALSE=OK)",{"$f":"IF(OR(bInputsError,bExpiryError,bVersionError,bSPAErrors),TRUE,FALSE)","v":true},"bOverallError"]
[]
[]
[]
[]
[null,null,{"$f":"strToolName& \"(Admin view) joiner - Global tables, assumptions, errors\"","v":"Joiner Tool(Admin view) joiner - Global tables, assumptions, errors"}]
[]
[null,"Business Assumptions"]
[]
[]
[null,"Business assumptions",null,"Name",null,"Version Number",104,"VersionNumber"]
[null,"Assumed Public Service NPA",65,"PSNPA",null,"Security Classification","Unclassified","SecurityClassification"]
[null,"Assumed OTHER service NPA",65,"OSNPA",null,"Tool Name","Joiner Tool","strToolName"]
[null,"2015 date","2015-03-31","day2015",null,"Today's Date",{"$f":"TODAY()","v":"2022-06-16"},"dayToday"]
[null,"2012 date","2012-03-31","day2012",null,"Tool Expiry Date","2023-04-01","dayExpiry"]
[]
[]
[null,null,{"$f":"strToolName& \"(Admin view) joiner - Global tables, assumptions, errors\"","v":"Joiner Tool(Admin view) joiner - Global tables, assumptions, errors"}]
[]
[]
[null,"Errors and other messages"]
[null,"General"]
[null,{"$f":"\"Check error messages.\"","v":"Check error messages."},null,null,null,null,null,null,"_errOverall"]
[null,{"$f":"\"Error\"","v":"Error"},null,null,null,null,null,null,"_errOverallShort"]
[null,"File not in correct location or filename incorrect, use correct version.  ",null,null,null,null,null,null,"_errLocation"]
[null,{"$f":"\"Security Classification: \"&SecurityClassification&\".  \"","v":"Security Classification: Unclassified.  "},null,null,null,null,null,null,"msgSecurityClassification"]
[null,{"$f":"\"Printed on \" &TEXT(dayToday,\"dd mmm yyyy\")&\".  \"","v":"Printed on 16 Jun 2022.  "},null,null,null,null,null,null,"msgPrint"]
[null,{"$f":"\"Version number : \"&(TEXT(VersionNumber,\"0\"))&\".  \"","v":"Version number : 104.  "},null,null,null,null,null,null,"msgVersionNumber"]
[null,"PDF saved to : TBC",null,null,null,null,null,null,"msgPDFSaveLocation"]
[null,{"$f":"\"Filename : \"&LEFT(CELL(\"filename\",strToolName),FIND(\"]\",CELL(\"filename\",strToolName))-1)","v":"Filename : C:\\Users\\roweg\\AppData\\Local\\Microsoft\\Windows\\INetCache\\Content.Outlook\\Q0ID2JYB\\[joiner-tool_april-2022.xlsm"},null,null,null,null,null,null,"msgFileName"]
[null,{"$f":"\"Tool expires on \"&TEXT(dayExpiry,\"dd/mm/yyyy\")&\".  \"","v":"Tool expires on 01/04/2023.  "},null,null,null,null,null,null,"msgExpiration"]
[null,{"$f":"\"Security Classification: \"&SecurityClassification&\".  \"","v":"Security Classification: Unclassified.  "},null,null,null,null,null,null,"msgSecurityClassification"]
[null,{"$f":"\"\" &TEXT(NOW(),\"hh:mm,  dd mmm yyyy \")&\".  \"","v":"08:08,  16 Jun 2022 .  "},null,null,null,null,null,null,"msgPrint"]
[null,"PDF saved to : TBC",null,null,null,null,null,null,"msgPDFSaveLocation"]
[null,{"$f":"\"Not Found : Carry on or check error messages\"","v":"Not Found : Carry on or check error messages"},null,null,null,null,null,null,"errNotFound"]
[null,{"$f":"\"Check inputs\"","v":"Check inputs"},null,null,null,null,null,null,"errCheckInputs"]
[null,"Not all paths are unique",null,null,null,null,null,null,"errServiceGT45"]
[]
[]
[]
[null,null,{"$f":"strToolName&\" - Tables\"","v":"Joiner Tool - Tables"}]
[]
[]
[null,"Tables used in calculations/sheets"]
[null,null,null,"tabSchemeList, tabNPA",null,null,"tabPensionArrangement"]
[null,"tabYesNo",null,"Scheme List","NPA",null,"Pension Arrangement"]
[null,"Yes/No",null,null,null,null,"Civil Service"]
[null,"Yes",null,"PCSPS (left before October 2002)",60,null,"By Analogy"]
[null,"No",null,"classic",60]
[null,null,null,"premium",60]
[null,"tabSex",null,"classic plus",60]
[null,"Male/Female",null,"partnership (joined before 30 July 07)",65]
[null,"Male",null,"nuvos",65,null,"tabEmploymentType"]
[null,"Female",null,"partnership (joined after 29 July 07)",65,null,"Employment type"]
[null,null,null,{"$f":"IF(StartDate<day2015_+1,\"\",\"alpha\")","v":""},"State Pension Age",null,{"$f":"IF(PrevMemCS=\"Y\",\"Civil\",\"\")","v":""}]
[null,null,null,"By-Analogy Scheme","NA",null,{"$f":"IF(PrevMemPS=\"Y\",\"Public\",\"\")","v":""}]
[null,null,null,null,null,null,"Other"]
[]
[]
[]
[null,"Taper Data"]
[null,"tabProtection, tabProtection2"]
[null,"Years before NPA at 1st April 2012     ","Months","Complete Months","Months of Protection","Protection End Date"]
[null,10,1,{"$f":"B84*12+C84","v":121},82,"2022-02-01"]
[null,10,2,122,80,"2021-12-01"]
[null,10,3,123,78,"2021-10-01"]
[null,10,4,124,76,"2021-08-01"]
[null,10,5,125,74,"2021-06-01"]
[null,10,6,126,72,"2021-04-01"]
[null,10,7,127,70,"2021-02-01"]
[null,10,8,128,68,"2020-12-01"]
[null,10,9,129,66,"2020-10-01"]
[null,10,10,130,64,"2020-08-01"]
[null,10,11,131,62,"2020-06-01"]
[null,11,0,132,60,"2020-04-01"]
[null,11,1,133,58,"2020-02-01"]
[null,11,2,134,56,"2019-12-01"]
[null,11,3,135,54,"2019-10-01"]
[null,11,4,136,52,"2019-08-01"]
[null,11,5,137,50,"2019-06-01"]
[null,11,6,138,48,"2019-04-01"]
[null,11,7,139,46,"2019-02-01"]
[null,11,8,140,44,"2018-12-01"]
[null,11,9,141,42,"2018-10-01"]
[null,11,10,142,40,"2018-08-01"]
[null,11,11,143,38,"2018-06-01"]
[null,12,0,144,36,"2018-04-01"]
[null,12,1,145,34,"2018-02-01"]
[null,12,2,146,32,"2017-12-01"]
[null,12,3,147,30,"2017-10-01"]
[null,12,4,148,28,"2017-08-01"]
[null,12,5,149,26,"2017-06-01"]
[null,12,6,150,24,"2017-04-01"]
[null,12,7,151,22,"2017-02-01"]
[null,12,8,152,20,"2016-12-01"]
[null,12,9,153,18,"2016-10-01"]
[null,12,10,154,16,"2016-08-01"]
[null,12,11,155,14,"2016-06-01"]
[null,13,0,156,12,"2016-04-01"]
[null,13,1,157,10,"2016-02-01"]
[null,13,2,158,8,"2015-12-01"]
[null,13,3,159,6,"2015-10-01"]
[null,13,4,160,4,"2015-08-01"]
[null,13,5,161,2,"2015-06-01"]
[null,13,6,162,0,"2015-04-01"]

{"sheet":"Cover Sheet_hide","index":6,"n_rows":28,"n_cols":11,"rows_kept":28,"cut":false,"hidden":true,"merged":[[1,1,7,10],[10,1,10,10]]}
[]
[null,"MyCSP\nSCU\nPension Questionnaire and Joiner Tool\nName : Joiner.xlsm"]
[]
[]
[]
[]
[]
[]
[]
[]
[null,{"$f":"msgSecurityClassification","v":"Security Classification: Unclassified.  "}]
[]
[]
[null,"Revision History"]
[null,"Version ","Name of file","Previous Version","Date","Author ","Team ","Description","Reviewed By, Name","Review Date","Review Comments and sign off"]
[null,0.1,"MYCSP","MYCSP","MYCSP","MYCSP","MYCSP","Version History V1.0.4 18022015.docx","MYCSP","MYCSP"]
[null,0.14000000000000001,"MYCSP","MYCSP","MYCSP","MYCSP","MYCSP","Version History V1.0.4 18022015.docx","MYCSP","MYCSP"]
[null,0.55000000000000004,"MYCSP","MYCSP","MYCSP","MYCSP","MYCSP","Version History V1.0.4 18022015.docx","MYCSP","MYCSP"]
[null,0.63,"MYCSP","MYCSP","MYCSP","MYCSP","MYCSP","Version History V1.0.4 18022015.docx","MYCSP","MYCSP"]
[null,0.68,"MYCSP","MYCSP","MYCSP","MYCSP","MYCSP","Version History V1.0.4 18022015.docx","MYCSP","MYCSP"]
[null,0.76,"MYCSP","MYCSP","MYCSP","MYCSP","MYCSP","Version History V1.0.4 18022015.docx","MYCSP","MYCSP"]
[null,0.77,"MYCSP","MYCSP","MYCSP","MYCSP","MYCSP","Version History V1.0.4 18022015.docx","MYCSP","MYCSP"]
[null,0.82,"MYCSP","MYCSP","MYCSP","MYCSP","MYCSP","Version History V1.0.4 18022015.docx","MYCSP","MYCSP"]
[null,1,"MYCSP","MYCSP","MYCSP","MYCSP","MYCSP","Version History V1.0.4 18022015.docx","MYCSP","MYCSP"]
[null,null,"MYCSP","MYCSP","MYCSP","MYCSP","MYCSP","Version History V1.0.4 18022015.docx","MYCSP","MYCSP"]
[null,1,"MYCSP","MYCSP","MYCSP","MYCSP","MYCSP","Version History V1.0.4 18022015.docx","MYCSP","MYCSP"]
[null,103,"MYCSP","MYCSP","MYCSP","MYCSP","MYCSP","Version History V1.0.4 18022015.docx","MYCSP","MYCSP"]
[null,104,"MYCSP","MYCSP","MYCSP","MYCSP","MYCSP","Version History V1.0.4 18022015.docx","MYCSP","MYCSP"]

{"sheet":"Email Templates","index":7,"n_rows":2,"n_cols":16,"rows_kept":2,"cut":false,"hidden":true,"merged":[]}
["Premium",null,"Alpha"]
["Congratulations on your recent appointment within the Civil Service.\n\nA career in the Civil Service offers you a range of opportunities and benefits, including membership in the Civil Service pension scheme. \n\nI’m pleased to inform you that you’re eligible to join either:\n\n•\tthe premium scheme; or \n•\tthe partnership scheme. \n\nWhat to do next\n\n1.\tYou have been automatically enrolled into the premium pension scheme however you have a choice in which scheme you want to join. To help you decide, please read premium or partnership: an overview: https://tinyurl.com/ydkaadna.\n\n2.\tLet <INSERT RECRUITMENT CONTACT> know by completing and returning a Pension Choices form: https://tinyurl.com/52srnjtc.\n\nImportant: if you join premium, your partner may be eligible to receive a partner’s pension in the event of your death. It isn’t mandatory, but you can provide your partner’s details by completing a Partner Details form: https://tinyurl.com/cyh2uwu8 which will help Civil Service Pensions to determine your partner’s eligibility. \n\n3.\tYou may be able to transfer pension benefits into your Civil Service pension. For more information, email Civil Service Pensions at newjoiners@mycsp.co.uk.\n\nKind regards","Congratulations on your recent appointment within the Civil Service. \n\nA career in the Civil Service offers you a range of opportunities and benefits, including membership in the Civil Service pension scheme. \n\nI’m pleased to inform you that you’re eligible to join either:\n\n•\tthe nuvos scheme; or \n•\tthe partnership scheme. \n\nWhat to do next\n\n1.\tYou have been automatically enrolled into the nuvos pension scheme however you have a choice in which scheme you want to join. To help you decide, please read nuvos or partnership: an overview: https://tinyurl.com/3evuxtjm.\n\n2.\tLet <INSERT RECRUITMENT CONTACT> know by completing and returning a Pension Choices form: https://tinyurl.com/2du792p6.\n\nImportant: if you join nuvos, your partner may be eligible to receive a partner’s pension in the event of your death. It isn’t mandatory, but you can provide your partner’s details by completing a Partner Details form: https://tinyurl.com/cyh2uwu8 which will help Civil Service Pensions to determine your partner’s eligibility.\n\n3.\tYou may be able to transfer (previously built up) pension benefits into your Civil Service pension. For more information, please email Civil Service Pensions at newjoiners@mycsp.co.uk.\n\nKind regards","Congratulations on your recent appointment within the Civil Service.\n\nA career in the Civil Service offers you a range of opportunities and benefits, including membership in the Civil Service pension scheme. \n\nI’m pleased to inform you that you’re eligible to join either:\n\n•           the alpha scheme; or\n•           the partnership scheme. \n\nWhat to do next:\n\n1.        You have been automatically enrolled into the alpha pension scheme however you have a choice in which scheme you want to join. To help you decide, please read alpha or partnership: an overview: https://www.civilservicepensionscheme.org.uk/joining-the-pension-scheme/alpha-or-partnership/.\n\n2.         Let <INSERT RECRUITMENT CONTACT> know by completing and returning a Pension Choices form: https://www.civilservicepensionscheme.org.uk/media/g4ffzir1/new-starter_alpha-june-2021-25062021.pdf.\n\nImportant: if you join alpha, your partner may be eligible to receive a partner’s pension in the event of your death. It isn’t mandatory, but you can provide your partner’s details by completing a Partner Details form: https://www.civilservicepensionscheme.org.uk/media/fxwiou0k/partner-details-form-june-2018.pdf which will help Civil Service Pensions to determine your partner’s eligibility.\n\n3.         You may be able to transfer (previously built up) pension benefits into your Civil Service pension. A transfer-in application form can be found here: https://www.civilservicepensionscheme.org.uk/media/zgwnvndg/transfer-in-application-form.pdf\n    \nKind regards",null,null,null,null,"Dear test,\n\nCongratulations on your recent appointment within the Civil Service.\n\nA career in the Civil Service offers you a range of opportunities and benefits, including membership in the Civil Service pension scheme. \n\nI’m pleased to inform you that you’re eligible to join either:\n\n•           the alpha scheme; or\n•           the partnership scheme. \n\nWhat to do next:\n\n1.        You have been automatically enrolled into the alpha pension scheme however you have a choice in which scheme you want to join. To help you decide, please read alpha or partnership: an overview: https://tinyurl.com/4342akey.\n\n2.         Let <INSERT RECRUITMENT CONTACT> know by completing and returning a Pension Choices form: https://tinyurl.com/29nmbk5x.\n\nImportant: if you join alpha, your partner may be eligible to receive a partner’s pension in the event of your death. It isn’t mandatory, but you can provide your partner’s details by completing a Partner Details form: https://tinyurl.com/cyh2uwu8 which will help Civil Service Pensions to determine your partner’s eligibility.\n\n3.         You may be able to transfer (previously built up) pension benefits into your Civil Service pension. For more information, please email Civil Service Pensions at newjoiners@mycsp.co.uk.\n    \nKind regards",null,null,null,null,null,null,null,"Congratulations on your recent appointment.\n\nA career in the Civil Service offers you a range of opportunities and benefits, including access to the Civil Service pension scheme. Therefore, I’m pleased to inform you that you are eligible to join either of the following schemes:\n\n    - premium; or\n    - partnership\n\nWhat to do next:\n\n     1. Choose which scheme to join. To help you decide, please read Premium or Partnership: An Overview, found here: http://mycsp.co.uk/test.\n\n     2. Inform Civil Service Pensions of your choice by completing and returning the Pension Choices form in your New Joiner Pack (attached). \n\nImportant: if you join the premium scheme you can nominate your partner to receive a partner’s pension in the event of your death. To do this, complete and return the Partner Details form (attached). \n\n     3. Transfer a pension from previous employment. If you’ve previously worked for an employer covered by the Civil Service pension arrangements, you may be able to transfer in a pension. For more information email Civil Service Pensions at contactcentre@mycsp.co.uk   \n    \nKind regards\n"]